{"text_format":"1","workbook":"xlsx","n_sheets":13,"sheets":["①交付申請書","②-1申請額算出内訳（入所支援施設） (2)","②-2申請額算出内訳 （共同生活援助系) (2)","②-3申請額算出内訳 (児・者通所系) (2)","②-4申請額算出内訳 (児・者訪問系)","③口座振替申出書","④口座の写し添付用シート","⑤光熱費申出書","⑥電気・ガスの契約種別がわかるもの","請求書","交付金checklist","食事提供加算有","食事提供加算無"],"not_rendered":{"charts":0,"images":0,"macros":1,"external_links":5,"defined_names":36,"comments":5,"pivot_tables":0},"unopened":[],"bounds":{"document_bytes":16777216,"sheet_cells":100000,"rows_first":2000,"rows_last":500,"rows_between":2000,"halvings":0,"cell_chars":16384,"cell_head_chars":4096},"cells_cut":0,"cells_raw":0,"read":"whole","date_system":"1900"}

{"sheet":"①交付申請書","index":0,"n_rows":38,"n_cols":7,"rows_kept":38,"cut":false,"hidden":false,"merged":[[6,0,6,7],[1,0,1,7],[2,0,2,7],[3,0,3,7],[0,0,0,7],[4,0,4,7],[5,0,5,7],[7,0,7,7],[8,0,8,7],[9,0,9,7],[10,0,10,7],[29,3,29,7],[11,5,11,7],[37,5,37,7],[12,5,12,7],[13,5,13,7],[14,5,14,7],[23,4,23,5],[28,0,28,7],[27,0,27,2],[27,3,27,7],[15,0,15,7],[16,0,16,7],[12,0,12,4],[13,0,13,4],[14,0,14,4],[31,0,31,7],[32,0,32,7],[19,0,19,7],[34,5,34,7],[35,5,35,7],[36,5,36,7],[11,0,11,4],[20,0,20,7],[21,0,21,7],[22,0,22,7],[17,0,17,7],[18,0,18,7],[23,0,23,2],[25,0,25,2],[25,3,25,7],[24,0,24,7],[26,0,26,7],[29,0,29,2]]}
["様式第１号（第６条関係）"]
[]
["令和７年度第３回埼玉県障害福祉サービス事業所等光熱費等高騰対策"]
["支援事業補助金交付申請書"]
[]
["第　　　　　号"]
["令和　年　月　日"]
[]
["（宛先）"]
["  埼玉県知事"]
[]
["（申請者）"]
["所　 在 　地"]
["法人等の名称"]
["代表者職氏名"]
[]
[]
["　下記により、令和７年度第３回埼玉県障害福祉サービス事業所等光熱費等高騰対策支援"]
["事業補助金の交付を受けたいので、補助金等の交付手続等に関する規則第４条の規定によ"]
["り、関係書類を添えて申請します。"]
[]
["記"]
[]
["１　補助金交付申請額",null,null,"金",{"$f":"'②-1申請額算出内訳（入所支援施設） (2)'!M27+'②-2申請額算出内訳 （共同生活援助系) (2)'!N27+'②-3申請額算出内訳 (児・者通所系) (2)'!N27+'②-4申請額算出内訳 (児・者訪問系)'!L27","v":0},null,"円"]
[]
["２　申請額算出内訳",null,null,"別紙１のとおり"]
[]
["３　口座振込申出書",null,null,"別紙２のとおり"]
[]
["４　光熱費に係る種別の申出書",null,null,"別紙３のとおり"]
[]
["５　申請に係る施設・事業所の事業開始を確認できる書類"]
["  （ ※指定申請書の写し等を添付） "]
[null,null,null,null,"【連絡先】"]
[null,null,null,null,"部署名"]
[null,null,null,null,"担当者氏名"]
[null,null,null,null,"電話番号"]
[null,null,null,null,"e-mail"]

{"sheet":"②-1申請額算出内訳（入所支援施設） (2)","index":1,"n_rows":31,"n_cols":13,"rows_kept":31,"cut":false,"hidden":false,"merged":[[0,7,0,8],[0,9,0,10],[2,0,2,10],[4,7,4,10]]}
["別紙１－１（児・者入所支援施設）",null,null,null,null,null,null,"申請者(法人）名：　　　　　　　　　　　　　　　　　　　　",null,{"$f":"①交付申請書!F14","v":0}]
[]
["申　　請　　額　　算　　出　　内　　訳"]
[]
[]
["№","事業所番号","施設・事業所名","住所\n（市・町名）","住所２（区名以下）","サービス種別","事業開始日","　　交付対象数（A）\n入所施設　➡　定員数","交付単位\n人\n事業所\n住居","ガス","補助単価\n(B)","プロパンガスの場合、控除","申請額\n(A×B)"]
["記入例\n1",2222222222,"世界埼玉にゅうしょ施設","縄文市","南区まがたま町１－２－３","福祉型障害児入所施設","2044-01-01",55,"人","プロパンガス",{"$f":"VLOOKUP(F7&J7,食事提供加算有!A:E,5,FALSE)","v":45100},{"$f":"VLOOKUP(F7&J7,食事提供加算有!A:F,6,FALSE)","v":3200},{"$f":"H7*K7-L7","v":2477300}]
["記入例２",1111222222,"川口にゅうしょ施設","AB市","南区南町１－２－３","医療型障害児入所施設","2016-01-01",40,"人","プロパンガス",{"$f":"VLOOKUP(F8&J8,食事提供加算有!A:E,5,FALSE)","v":45100},{"$f":"VLOOKUP(F8&J8,食事提供加算有!A:F,6,FALSE)","v":3200},{"$f":"H8*K8-L8","v":1800800}]
[1,null,null,null,null,null,null,null,null,null,null,null,{"$f":"H9*K9-L9","v":0}]
[2,null,null,null,null,null,null,null,null,null,null,null,{"$f":"H10*K10-L10","v":0}]
[3]
[4]
[5,null,null,null,null,null,null,null,null,null,null,null,{"$f":"H13*K13-L13","v":0}]
[6]
[7,null,null,null,null,null,null,null,null,null,null,null,0]
[8,null,null,null,null,null,null,null,null,null,null,null,0]
[9,null,null,null,null,null,null,null,null,null,null,null,0]
[10,null,null,null,null,null,null,null,null,null,null,null,0]
[11,null,null,null,null,null,null,null,null,null,null,null,0]
[12,null,null,null,null,null,null,null,null,null,null,null,0]
[13,null,null,null,null,null,null,null,null,null,null,null,0]
[14,null,null,null,null,null,null,null,null,null,null,null,0]
[15,null,null,null,null,null,null,null,null,null,null,null,0]
[16,null,null,null,null,null,null,null,null,null,null,null,0]
[17,null,null,null,null,null,null,null,null,null,null,null,0]
[18,null,null,null,null,null,null,null,null,null,null,null,0]
[null,null,null,null,null,null,null,null,null,null,null,"合計",{"$f":"SUM(M9:M26)","v":0}]
[]
["※事業所番号が未記入あるいは誤った番号を記載した場合は対象外となるので誤記などないよう十分に注意すること。"]
["※「サービス種別」欄は、補助要綱別表１に掲げる種別を記載すること。"]
["※「補助単価」欄は、補助要綱別表２に掲げる区分ごとの単価を記載すること。"]

{"sheet":"②-2申請額算出内訳 （共同生活援助系) (2)","index":2,"n_rows":31,"n_cols":20,"rows_kept":31,"cut":false,"hidden":false,"merged":[[0,7,0,8],[0,9,0,13],[2,0,2,13],[4,7,4,13]]}
["別紙１－２（共同生活援助系）",null,null,null,null,null,null,"申請者(法人）名：　　　　　　　　　　　　　　　　　　　　",null,{"$f":"①交付申請書!F14","v":0}]
[]
["申　　請　　額　　算　　出　　内　　訳"]
[]
[]
["№","事業所番号","グループホームの住居名\n※住居毎に記載","住所\n（市・町名）","住所２（区名以下）","サービス種別","事業開始日","　　交付対象数（A）\nＧＨ➡１住居の定員数（1住居5人以下の場合は一律6人）","交付単位\n人","電力\n（訪問、入所施設は記入不要）","ガス","補助単価\n(B)","プロパンガスの場合、控除","申請額\n(A×B)"]
["記入例",1111111111,"大宮グループホーム１","大和市","北区さいたま町１－２－３","共同生活援助（介護サービス包括型）","2043-01-01",10,"人","高圧","都市ガス",{"$f":"VLOOKUP(F7&J7&K7,食事提供加算無!A:E,5,FALSE)","v":6100},{"$f":"VLOOKUP(F7&J7&K7,食事提供加算無!A:F,6,FALSE)","v":0},{"$f":"H7*L7-M7","v":61000}]
["記入例\n２",2222222222,"大宮グループホーム２","大和市","南区まがたま町１－２－３","共同生活援助（介護サービス包括型）","2044-01-01",6,"人","低圧","プロパンガス",{"$f":"VLOOKUP(F8&J8&K8,食事提供加算無!A:E,5,FALSE)","v":4900},{"$f":"VLOOKUP(F8&J8&K8,食事提供加算無!A:F,6,FALSE)","v":3200},26200]
[1,null,null,null,null,null,null,null,null,null,null,null,null,{"$f":"H9*L9-M9","v":0},null,null,null,null,null,"共同生活援助（指定共同生活援助）"]
[2,null,null,null,null,null,null,null,null,null,null,null,null,null,null,null,null,null,null,"共同生活援助（日中サービス支援型）"]
[3,null,null,null,null,null,null,null,null,null,null,null,null,null,null,null,null,null,null,"共同生活援助（外部サービス利用型）"]
[4]
[5]
[6]
[7]
[8]
[9]
[10]
[11]
[12,null,null,null,null,null,null,null,null,null,null,null,null,{"$f":"H20*L20-M20","v":0}]
[13,null,null,null,null,null,null,null,null,null,null,null,null,{"$f":"H21*L21-M21","v":0}]
[14,null,null,null,null,null,null,null,null,null,null,null,null,0]
[15,null,null,null,null,null,null,null,null,null,null,null,null,0]
[16,null,null,null,null,null,null,null,null,null,null,null,null,0]
[17,null,null,null,null,null,null,null,null,null,null,null,null,0]
[18]
[null,null,null,null,null,null,null,null,null,null,null,"合計",null,{"$f":"SUM(N9:N26)","v":0}]
[]
["※事業所番号が未記入あるいは誤った番号を記載した場合は対象外となるので誤記などないよう十分に注意すること。"]
["※「サービス種別」欄は、補助要綱別表１に掲げる種別を記載すること。"]
["※「補助単価」欄は、補助要綱別表２に掲げる区分ごとの単価を記載すること。"]

{"sheet":"②-3申請額算出内訳 (児・者通所系) (2)","index":3,"n_rows":31,"n_cols":19,"rows_kept":31,"cut":false,"hidden":false,"merged":[[0,7,0,8],[0,9,0,13],[2,0,2,13],[4,7,4,13]]}
["別紙１－３（児・者通所系）",null,null,null,null,null,null,"申請者(法人）名：　　　　　　　　　　　　　　　　　　　　",null,{"$f":"①交付申請書!F14","v":0}]
[]
["申　　請　　額　　算　　出　　内　　訳"]
[]
[]
["№","事業所番号","施設・事業所名","住所\n（市・町名）","住所２（区名以下）","サービス種別","事業開始日","　　交付対象数（A）\n通所・訪問➡　事業所数","交付単位\n人\n事業所\n住居","食事提供体制加算\n（児通所は児童発達支援センターのみ。食事提供加算を請求している場合）","電力\n（訪問、入所施設は記入不要）","ガス","補助単価\n(B)","申請額\n(A×B)"]
["記入例",1111111111,"世界さいたま事業所","大和市","北区さいたま町１－２－３","就労移行支援","2043-01-01",1,"事業所","有","高圧","都市ガス",{"$f":"VLOOKUP(F7&K7&L7,食事提供加算有!A:F,5,FALSE)","v":469500},{"$f":"H7*M7","v":469500}]
["記入例\n２",2222222222,"さいたま放課後等デイサービス","縄文市","南区まがたま町１－２－３","児童発達支援","2044-01-01",1,"事業所","無","低圧","プロパンガス",{"$f":"VLOOKUP(F8&K8&L8,食事提供加算無!A:F,5,FALSE)","v":13350},{"$f":"H8*M8","v":13350}]
[1,null,null,null,null,null,null,null,null,null,null,null,null,{"$f":"H9*M9","v":0},null,null,null,null,"生活介護"]
[2,null,null,null,null,null,null,null,null,null,null,null,null,{"$f":"H10*M10","v":0},null,null,null,null,"短期入所（単独型）"]
[3,null,null,null,null,null,null,null,null,null,null,null,null,null,null,null,null,null,"療養介護"]
[4,null,null,null,null,null,null,null,null,null,null,null,null,null,null,null,null,null,"自立訓練（機能訓練）"]
[5,null,null,null,null,null,null,null,null,null,null,null,null,null,null,null,null,null,"自立訓練（生活訓練）"]
[6,null,null,null,null,null,null,null,null,null,null,null,null,{"$f":"H14*M14","v":0},null,null,null,null,"自立訓練（宿泊型）"]
[7,null,null,null,null,null,null,null,null,null,null,null,null,0,null,null,null,null,"就労移行支援"]
[8,null,null,null,null,null,null,null,null,null,null,null,null,0,null,null,null,null,"就労継続支援Ａ型"]
[9,null,null,null,null,null,null,null,null,null,null,null,null,0,null,null,null,null,"就労継続支援Ｂ型"]
[10,null,null,null,null,null,null,null,null,null,null,null,null,0,null,null,null,null,"児童発達支援"]
[11,null,null,null,null,null,null,null,null,null,null,null,null,0,null,null,null,null,"児童発達支援センター"]
[12,null,null,null,null,null,null,null,null,null,null,null,null,0,null,null,null,null,"医療型児童発達支援センター"]
[13,null,null,null,null,null,null,null,null,null,null,null,null,0,null,null,null,null,"放課後等デイサービス"]
[14,null,null,null,null,null,null,null,null,null,null,null,null,0]
[15,null,null,null,null,null,null,null,null,null,null,null,null,0]
[16,null,null,null,null,null,null,null,null,null,null,null,null,0]
[17,null,null,null,null,null,null,null,null,null,null,null,null,0]
[18,null,null,null,null,null,null,null,null,null,null,null,null,0]
[null,null,null,null,null,null,null,null,null,null,null,null,"合計",{"$f":"SUM(N9:N26)","v":0}]
[]
["※事業所番号が未記入あるいは誤った番号を記載した場合は対象外となるので誤記などないよう十分に注意すること。"]
["※「サービス種別」欄は、補助要綱別表１に掲げる種別を記載すること。"]
["※「補助単価」欄は、補助要綱別表２に掲げる区分ごとの単価を記載すること。"]

{"sheet":"②-4申請額算出内訳 (児・者訪問系)","index":4,"n_rows":31,"n_cols":15,"rows_kept":31,"cut":false,"hidden":false,"merged":[[0,7,0,8],[0,9,0,11],[2,0,2,11],[4,7,4,11]]}
["別紙１－４（児・者訪問系）",null,null,null,null,null,null,"申請者(法人）名：　　　　　　　　　　　　　　　　　　　　",null,{"$f":"①交付申請書!F14","v":0}]
[]
["申　　請　　額　　算　　出　　内　　訳"]
[]
[]
["№","事業所番号","施設・事業所名","住所\n（市・町名）","住所２（区名以下）","サービス種別","事業開始日","　　交付対象数（A）\n通所・訪問➡　事業所数","交付単位\n人\n事業所\n住居","ガス","補助単価\n(B)","申請額\n(A×B)"]
["記入例",1111111111,"世界さいたま事業所","大和市","北区さいたま町１－２－３","居宅介護","2043-01-01",1,"事業所","都市ガス",{"$f":"_xlfn.IFNA(VLOOKUP(F7&J7,食事提供加算無!$A$9:$E$24,5,FALSE),\"該当なし\")","v":4100},{"$f":"K7","v":4100}]
["記入例\n２",2222222222,"さいたま放課後等訪問支援","縄文市","南区まがたま町１－２－３","保育所等訪問支援","2044-01-01",1,"事業所","プロパンガス",{"$f":"_xlfn.IFNA(VLOOKUP(F8&J8,食事提供加算無!$A$9:$E$24,5,FALSE),\"該当なし\")","v":3600},3600]
[1,null,null,null,null,null,null,null,null,null,{"$f":"_xlfn.IFNA(VLOOKUP(F9&J9,食事提供加算無!$A$9:$E$24,5,FALSE),\"\")","v":""},{"$f":"K9","v":""},null,null,"居宅介護"]
[2,null,null,null,null,null,null,null,null,null,{"$f":"_xlfn.IFNA(VLOOKUP(F10&J10,食事提供加算無!$A$9:$E$24,5,FALSE),\"\")","v":""},{"$f":"K10","v":""},null,null,"重度訪問介護"]
[3,null,null,null,null,null,null,null,null,null,{"$f":"_xlfn.IFNA(VLOOKUP(F11&J11,食事提供加算無!$A$9:$E$24,5,FALSE),\"\")","v":""},"",null,null,"同行援護"]
[4,null,null,null,null,null,null,null,null,null,{"$f":"_xlfn.IFNA(VLOOKUP(F12&J12,食事提供加算無!$A$9:$E$24,5,FALSE),\"\")","v":""},"",null,null,"行動援護"]
[5,null,null,null,null,null,null,null,null,null,{"$f":"_xlfn.IFNA(VLOOKUP(F13&J13,食事提供加算無!$A$9:$E$24,5,FALSE),\"\")","v":""},"",null,null,"重度障害者等包括支援"]
[6,null,null,null,null,null,null,null,null,null,{"$f":"_xlfn.IFNA(VLOOKUP(F14&J14,食事提供加算無!$A$9:$E$24,5,FALSE),\"\")","v":""},"",null,null,"居宅訪問型児童発達支援"]
[7,null,null,null,null,null,null,null,null,null,{"$f":"_xlfn.IFNA(VLOOKUP(F15&J15,食事提供加算無!$A$9:$E$24,5,FALSE),\"\")","v":""},"",null,null,"保育所等訪問支援"]
[8,null,null,null,null,null,null,null,null,null,{"$f":"_xlfn.IFNA(VLOOKUP(F16&J16,食事提供加算無!$A$9:$E$24,5,FALSE),\"\")","v":""},"",null,null,"児訪問系"]
[9,null,null,null,null,null,null,null,null,null,{"$f":"_xlfn.IFNA(VLOOKUP(F17&J17,食事提供加算無!$A$9:$E$24,5,FALSE),\"\")","v":""},""]
[10,null,null,null,null,null,null,null,null,null,{"$f":"_xlfn.IFNA(VLOOKUP(F18&J18,食事提供加算無!$A$9:$E$24,5,FALSE),\"\")","v":""},""]
[11,null,null,null,null,null,null,null,null,null,{"$f":"_xlfn.IFNA(VLOOKUP(F19&J19,食事提供加算無!$A$9:$E$24,5,FALSE),\"\")","v":""},""]
[12,null,null,null,null,null,null,null,null,null,{"$f":"_xlfn.IFNA(VLOOKUP(F20&J20,食事提供加算無!$A$9:$E$24,5,FALSE),\"\")","v":""},""]
[13,null,null,null,null,null,null,null,null,null,{"$f":"_xlfn.IFNA(VLOOKUP(F21&J21,食事提供加算無!$A$9:$E$24,5,FALSE),\"\")","v":""},""]
[14,null,null,null,null,null,null,null,null,null,{"$f":"_xlfn.IFNA(VLOOKUP(F22&J22,食事提供加算無!$A$9:$E$24,5,FALSE),\"\")","v":""},""]
[15,null,null,null,null,null,null,null,null,null,{"$f":"_xlfn.IFNA(VLOOKUP(F23&J23,食事提供加算無!$A$9:$E$24,5,FALSE),\"\")","v":""},""]
[16,null,null,null,null,null,null,null,null,null,{"$f":"_xlfn.IFNA(VLOOKUP(F24&J24,食事提供加算無!$A$9:$E$24,5,FALSE),\"\")","v":""},""]
[17,null,null,null,null,null,null,null,null,null,{"$f":"_xlfn.IFNA(VLOOKUP(F25&J25,食事提供加算無!$A$9:$E$24,5,FALSE),\"\")","v":""},""]
[18,null,null,null,null,null,null,null,null,null,{"$f":"_xlfn.IFNA(VLOOKUP(F26&J26,食事提供加算無!$A$9:$E$24,5,FALSE),\"\")","v":""},""]
[null,null,null,null,null,null,null,null,null,null,"合計",{"$f":"SUM(L9:L26)","v":0}]
[]
["※事業所番号が未記入あるいは誤った番号を記載した場合は対象外となるので誤記などないよう十分に注意すること。"]
["※「サービス種別」欄は、補助要綱別表１に掲げる種別を記載すること。"]
["※「補助単価」欄は、補助要綱別表２に掲げる区分ごとの単価を記載すること。"]

{"sheet":"③口座振替申出書","index":5,"n_rows":24,"n_cols":9,"rows_kept":24,"cut":false,"hidden":false,"merged":[[11,0,11,12],[8,0,8,5],[9,0,9,5],[10,0,10,5],[8,6,8,7],[9,6,9,7],[10,6,10,7],[8,8,8,12],[9,8,9,12],[10,8,10,12],[19,4,19,6],[12,0,12,12],[16,0,16,12],[13,0,13,12],[14,0,14,12],[23,0,23,12],[2,0,2,12],[0,0,0,12],[3,0,3,12],[6,0,6,12],[1,0,1,12],[4,0,4,12],[5,0,5,12],[20,4,20,12],[21,4,21,12],[7,0,7,12],[17,8,17,10],[18,8,18,10],[19,8,19,10],[17,4,17,6],[18,4,18,6]]}
["別紙２"]
[]
["令和７年度第３回埼玉県障害福祉サービス事業所等光熱費等高騰対策支援事業"]
["補助金口座振込申出書"]
[]
["（宛先）"]
["埼玉県知事　大野　元裕"]
[]
[null,null,null,null,null,null,"住　　　　所",null,{"$f":"①交付申請書!F13","v":0}]
[null,null,null,null,null,null,"法人等の名称",null,{"$f":"①交付申請書!F14","v":0}]
[null,null,null,null,null,null,"代表者職氏名",null,{"$f":"①交付申請書!F15","v":0}]
[]
["令和　年　月　日付けで申請した標記補助金について、交付決定を受けた"]
["場合、下記口座に振り込んでください。"]
["記"]
[]
[]
[null,null,"金融機関名",null,null,null,null,null,"金融機関コード"]
[null,null,"支店名",null,null,null,null,null,"支店コード"]
[null,null,"口座種別",null,null,null,null,null,"口座番号"]
[null,null,"口座名義(漢字)"]
[null,null,"口座名義(カナ)"]
[]
["※補助金の振込を希望する金融機関の口座名義、金融機関名、支店名、及び口座\n　番号等を確認できる通帳等の写しを添付すること。"]

{"sheet":"④口座の写し添付用シート","index":6,"n_rows":0,"n_cols":0,"rows_kept":0,"cut":false,"hidden":false,"merged":[]}

{"sheet":"⑤光熱費申出書","index":7,"n_rows":93,"n_cols":9,"rows_kept":93,"cut":false,"hidden":false,"merged":[[82,3,82,10],[82,11,84,12],[83,3,83,10],[84,3,84,10],[86,3,86,10],[86,11,88,12],[87,3,87,10],[88,3,88,10],[42,3,42,10],[42,11,43,12],[43,3,43,10],[45,3,45,10],[45,11,46,12],[46,3,46,10],[36,3,36,10],[36,11,37,12],[37,3,37,10],[39,3,39,10],[39,11,40,12],[40,3,40,10],[27,11,28,12],[28,3,28,10],[30,3,30,10],[30,11,31,12],[31,3,31,10],[27,3,27,10],[33,11,34,12],[34,3,34,10],[74,3,74,10],[74,11,76,12],[75,3,75,10],[76,3,76,10],[58,3,58,10],[58,11,60,12],[59,3,59,10],[60,3,60,10],[62,3,62,10],[62,11,64,12],[63,3,63,10],[64,3,64,10],[50,3,50,10],[50,11,52,12],[54,3,54,10],[54,11,56,12],[48,0,48,12],[78,3,78,10],[78,11,80,12],[79,3,79,10],[80,3,80,10],[66,3,66,10],[66,11,68,12],[67,3,67,10],[68,3,68,10],[70,3,70,10],[70,11,72,12],[71,3,71,10],[72,3,72,10],[90,0,90,12],[91,0,91,12],[18,3,18,10],[18,11,19,12],[19,3,19,10],[21,11,22,12],[24,3,24,10],[24,11,25,12],[55,3,55,10],[56,3,56,10],[33,3,33,10],[25,3,25,10],[21,3,21,10],[22,3,22,10],[51,3,51,10],[52,3,52,10],[14,0,14,12],[15,0,15,12],[16,0,16,12],[10,0,10,5],[10,6,10,7],[10,8,10,12],[11,0,11,12],[12,0,12,12],[13,0,13,12],[9,0,9,5],[9,6,9,7],[9,8,9,12],[0,0,0,12],[1,0,1,12],[2,0,2,12],[3,0,3,12],[4,0,4,12],[5,0,5,12],[6,0,6,12],[7,0,7,12],[8,0,8,5],[8,6,8,7],[8,8,8,12]]}
["別紙３"]
[]
["令和７年度第３回埼玉県障害福祉サービス事業所（又は住居）等光熱費等高騰対策"]
["支援事業補助金光熱費に係る種別の申出書"]
[]
["（宛先）"]
["埼玉県知事　大野　元裕"]
[]
[null,null,null,null,null,null,"住　　　　所",null,{"$f":"①交付申請書!F13","v":0}]
[null,null,null,null,null,null,"法人等の名称",null,{"$f":"①交付申請書!F14","v":0}]
[null,null,null,null,null,null,"代表者職氏名",null,{"$f":"①交付申請書!F15","v":0}]
[]
["令和　年　月　日付けで申請した標記補助金について、事業所（又は住居）等の光熱費の種別"]
["は下記のとおりです。"]
[]
["記"]
["１　令和５年度又は令和７年度に補助金を申請した事業所（又は住居）"]
[null,null,"　光熱費の契約内容に変更無の場合、添付書類（電気、ガスの明細書等）の提出は不要です。"]
[null,null,"事業所（又は住居）名"]
[null,null,"変更の有無"]
[]
[null,null,"事業所（又は住居）名"]
[null,null,"変更の有無"]
[]
[null,null,"事業所（又は住居）名"]
[null,null,"変更の有無"]
[]
[null,null,"事業所（又は住居）名"]
[null,null,"変更の有無"]
[]
[null,null,"事業所（又は住居）名"]
[null,null,"変更の有無"]
[]
[null,null,"事業所（又は住居）名"]
[null,null,"変更の有無"]
[]
[null,null,"事業所（又は住居）名"]
[null,null,"変更の有無"]
[]
[null,null,"事業所（又は住居）名"]
{"$rows_left_out":54}
{"sheet":"⑥電気・ガスの契約種別がわかるもの","index":8,"n_rows":31,"n_cols":1,"rows_kept":31,"cut":false,"hidden":false,"merged":[]}
[]
["１　電力　（高圧　又は　低圧　が分かるもの）"]
[]
[]
[]
[]
[]
[]
[]
[]
[]
[]
[]
[]
[]
[]
[]
[]
[]
[]
[]
[]
[]
[]
[]
[]
[]
[]
[]
[]
["２　ガス　（都市ガス　又は　プロパンガス　か分かるもの）"]

{"sheet":"請求書","index":9,"n_rows":36,"n_cols":7,"rows_kept":36,"cut":false,"hidden":false,"merged":[[11,0,11,4],[11,5,11,7],[0,0,0,7],[1,0,1,7],[2,0,2,7],[3,0,3,7],[4,0,4,7],[5,0,5,7],[6,0,6,7],[7,0,7,7],[8,0,8,7],[9,0,9,7],[10,0,10,7],[12,0,12,4],[12,5,12,7],[13,0,13,4],[13,5,13,7],[14,0,14,4],[14,5,14,7],[25,0,25,2],[25,3,25,7],[15,0,15,7],[16,0,16,7],[17,0,17,7],[18,0,18,7],[19,0,19,7],[20,0,20,7],[21,0,21,7],[22,0,22,7],[23,0,23,2],[23,4,23,5],[24,0,24,7],[32,5,32,7],[33,5,33,7],[34,5,34,7],[35,5,35,7],[26,0,26,7],[27,0,27,2],[27,3,27,7],[28,0,28,7],[29,0,29,7],[30,0,30,7]]}
["参考"]
[]
["令和７年度第３回埼玉県障害福祉サービス事業所等光熱費等高騰対策支援事業"]
["補助金請求書"]
[]
[]
[{"$f":"①交付申請書!A7","v":"令和　年　月　日"}]
[]
["（宛先）"]
["  埼玉県知事"]
[]
["（申請者）"]
["所　 在 　地",null,null,null,null,{"$f":"①交付申請書!F13","v":0}]
["法人等の名称",null,null,null,null,{"$f":"①交付申請書!F14","v":0}]
["代表者職氏名",null,null,null,null,{"$f":"①交付申請書!F15","v":0}]
[]
[]
["　下記により、令和７年度第３回埼玉県障害福祉サービス事業所等光熱費等高騰"]
["対策支援事業補助金の交付確定通知を受けたので、該当する補助金額を請求します。"]
[]
[]
["記"]
[]
["１　補助金請求額",null,null,"金",{"$f":"①交付申請書!E24","v":0},null,"円"]
[]
[]
[]
[]
[]
[]
[]
[null,null,null,null,"【連絡先】"]
[null,null,null,null,"部署名",{"$f":"①交付申請書!F35","v":0}]
[null,null,null,null,"担当者氏名",{"$f":"①交付申請書!F36","v":0}]
[null,null,null,null,"電話番号",{"$f":"①交付申請書!F37","v":0}]
[null,null,null,null,"e-mail",{"$f":"①交付申請書!F38","v":0}]

{"sheet":"交付金checklist","index":10,"n_rows":42,"n_cols":26,"rows_kept":42,"cut":false,"hidden":false,"merged":[[36,34,36,35],[30,2,30,35],[33,1,33,34],[35,3,35,4],[35,6,35,7],[35,9,35,10],[36,13,36,15],[36,16,36,17],[36,18,36,22],[36,23,36,24],[36,25,36,33],[24,2,24,33],[25,2,25,33],[35,13,35,15],[35,16,35,35],[27,2,27,33],[26,2,26,33],[15,0,15,35],[13,0,13,5],[14,0,14,5],[13,6,13,22],[13,23,13,25],[13,26,13,35],[14,6,14,8],[14,19,14,21],[14,22,14,35],[14,9,14,18],[9,0,11,5],[9,7,9,11],[10,6,10,35],[11,6,11,35],[12,0,12,5],[9,12,9,35],[12,23,12,35],[0,25,0,35],[3,0,3,35],[7,0,7,5],[7,6,7,35],[8,0,8,5],[8,6,8,35],[0,22,0,24],[19,2,19,33],[20,2,20,33],[21,2,21,33],[18,1,18,33],[23,2,23,33],[22,2,22,33]]}
[null,null,null,null,null,null,null,null,null,null,null,null,null,null,null,null,null,null,null,null,null,null,"No.",null,null,{"$f":"IF([5]基本情報入力シート!R11=\"\",\"\",[5]基本情報入力シート!R11)","v":""}]
[]
[]
["令和７年度第３回埼玉県障害福祉サービス事業所等光熱費等高騰対策支援事業補助金チェックリスト"]
[]
["◎　基本情報"]
[]
["フリガナ"]
["法人名",null,null,null,null,null,{"$f":"①交付申請書!F14","v":0}]
["法人所在地",null,null,null,null,null,"〒"]
[null,null,null,null,null,null,{"$f":"①交付申請書!F13","v":0}]
[]
["フリガナ"]
["書類作成担当者",null,null,null,null,null,null,null,null,null,null,null,null,null,null,null,null,null,null,null,null,null,null,"電話番号"]
["連絡先",null,null,null,null,null,"FAX番号",null,null,null,null,null,null,null,null,null,null,null,null,"E-mail"]
["※連絡先は必ず日中連絡できる電話番号を記載すること。不明な点等があれば事務局から問い合わせがあります。"]
[null,"以下の点を確認し、全ての項目にチェックして下さい。"]
[null,"　　　※（チェックできない項目があれば申請内容の修正が必要です。見直してください）"]
[null,"確認項目"]
[null,null,"令和８年１月１日時点で県から障害福祉サービス事業所、障害児者支援施設の指定を受けています。"]
[null,null,"令和８年１月１日時点で事業の休止、廃止はしていません。"]
[null,null,"補助金申請に必要な資料はすべて添付しています。"]
[null,null,"申請額算出内訳表には、必要な項目がすべて記載しています。"]
[null,null,"（提供サービスが異なっていても同じ住所地の事業所は申請できません。）\n同じ住所の事業所で２重申請はしていません。"]
[null,null,"（提供サービスが異なっていても同じ住所地の事業所は申請できません。高齢者等に対する訪問介護等も含みます。）\n同じ住所の事業所で２重申請はしていません。"]
[null,null,"（訪問系及び入所支援施設は確認不要）\n電力（高圧又は低圧）の選択に誤りはありません。"]
[null,null,"ガス（都市ガス又はプロパンガス）の選択に誤りはありません。"]
[null,null,"（障害児通所で食事有を選択する場合）\n児童発達支援センターであり、令和８年１月１日時点で食事提供加算を請求しており、３月３１日まで継続する。"]
[]
[null,"※","各証明資料は、指定権者からの求めがあった場合には、速やかに提出すること。"]
[null,"※　","本表への虚偽記載の他、交付金の請求に関して不正があった場合は、指定の取消しや補助金額の返還を求めることになります。"]
[]
[]
[null,"記載内容及び添付資料に虚偽がないことを証明するとともに、記載内容を証明する資料を適切に保管していることを誓約します。"]
[]
[null,"令和",null,null,null,"年",null,null,"月",null,null,"日",null,"法人名",null,null,{"$f":"①交付申請書!F14","v":0}]
[null,null,null,null,null,null,null,null,null,null,null,null,null,"代表者",null,null,"職名",null,null,null,null,null,null,"氏名"]
[]
[]
[]
{"$rows_left_out":3}
{"sheet":"食事提供加算有","index":11,"n_rows":75,"n_cols":13,"rows_kept":75,"cut":false,"hidden":true,"merged":[[64,2,66,2],[64,3,66,3],[64,4,66,4],[48,1,49,1],[48,2,51,2],[48,3,51,3],[48,4,51,4],[48,5,51,5],[48,6,51,6],[50,1,51,1],[1,2,9,2],[1,3,9,3],[1,4,9,4],[1,5,9,5],[1,6,9,6],[2,1,3,1]]}
[null,"通所系","支給単位","高圧かつ都市ガスを利用している場合","高圧かつプロパンガスを利用している場合","低圧かつ都市ガスを利用している場合","低圧かつプロパンガスを利用している場合","児・者　入所支援施設"]
[null,"生活介護","１事業所当たり",{"$f":"食事提供加算無!D28+408400","v":469500},{"$f":"食事提供加算無!E28+408400","v":482000},{"$f":"食事提供加算無!F28+408400","v":425800},{"$f":"食事提供加算無!G28+408400","v":438300},"障害者入所支援施設"]
[null,"短期入所（単独型）",null,null,null,null,null,"福祉型障害児入所施設"]
[null,null,null,null,null,null,null,"医療型障害児入所施設"]
[null,"自立訓練（機能訓練）",null,null,null,null,null,null,null,218100,219500,199900,201300]
[null,"自立訓練（生活訓練）"]
[null,"自立訓練（宿泊型）",null,null,null,null,null,null,null,469500]
[null,"就労移行支援",null,null,null,null,null,null,null,482000]
[null,"就労継続支援Ａ型",null,null,null,null,null,null,null,425800]
[null,"就労継続支援Ｂ型",null,null,null,null,null,null,null,438300]
[]
["key","通所系","高圧・低圧","都市ガス・プロパンガス","金額"]
[{"$f":"B13&C13&D13","v":"生活介護高圧都市ガス"},"生活介護","高圧","都市ガス",469500]
[{"$f":"B14&C14&D14","v":"生活介護高圧プロパンガス"},"生活介護","高圧","プロパンガス",482000]
["生活介護低圧都市ガス","生活介護","低圧","都市ガス",425800]
["生活介護低圧プロパンガス","生活介護","低圧","プロパンガス",438300]
["短期入所（単独型）高圧都市ガス","短期入所（単独型）","高圧","都市ガス",469500]
["短期入所（単独型）高圧プロパンガス","短期入所（単独型）","高圧","プロパンガス",482000]
["短期入所（単独型）低圧都市ガス","短期入所（単独型）","低圧","都市ガス",425800]
["短期入所（単独型）低圧プロパンガス","短期入所（単独型）","低圧","プロパンガス",438300]
["自立訓練（機能訓練）高圧都市ガス","自立訓練（機能訓練）","高圧","都市ガス",469500]
["自立訓練（機能訓練）高圧プロパンガス","自立訓練（機能訓練）","高圧","プロパンガス",482000]
["自立訓練（機能訓練）低圧都市ガス","自立訓練（機能訓練）","低圧","都市ガス",425800]
["自立訓練（機能訓練）低圧プロパンガス","自立訓練（機能訓練）","低圧","プロパンガス",438300]
["自立訓練（生活訓練）高圧都市ガス","自立訓練（生活訓練）","高圧","都市ガス",469500]
["自立訓練（生活訓練）高圧プロパンガス","自立訓練（生活訓練）","高圧","プロパンガス",482000]
["自立訓練（生活訓練）低圧都市ガス","自立訓練（生活訓練）","低圧","都市ガス",425800]
["自立訓練（生活訓練）低圧プロパンガス","自立訓練（生活訓練）","低圧","プロパンガス",438300]
["自立訓練（宿泊型）高圧都市ガス","自立訓練（宿泊型）","高圧","都市ガス",469500]
["自立訓練（宿泊型）高圧プロパンガス","自立訓練（宿泊型）","高圧","プロパンガス",482000]
["自立訓練（宿泊型）低圧都市ガス","自立訓練（宿泊型）","低圧","都市ガス",425800]
["自立訓練（宿泊型）低圧プロパンガス","自立訓練（宿泊型）","低圧","プロパンガス",438300]
["就労移行支援高圧都市ガス","就労移行支援","高圧","都市ガス",469500]
["就労移行支援高圧プロパンガス","就労移行支援","高圧","プロパンガス",482000]
["就労移行支援低圧都市ガス","就労移行支援","低圧","都市ガス",425800]
["就労移行支援低圧プロパンガス","就労移行支援","低圧","プロパンガス",438300]
["就労継続支援Ａ型高圧都市ガス","就労継続支援Ａ型","高圧","都市ガス",469500]
["就労継続支援Ａ型高圧プロパンガス","就労継続支援Ａ型","高圧","プロパンガス",482000]
["就労継続支援Ａ型低圧都市ガス","就労継続支援Ａ型","低圧","都市ガス",425800]
["就労継続支援Ａ型低圧プロパンガス","就労継続支援Ａ型","低圧","プロパンガス",438300]
{"$rows_left_out":36}
{"sheet":"食事提供加算無","index":12,"n_rows":147,"n_cols":11,"rows_kept":147,"cut":false,"hidden":true,"merged":[[125,2,127,2],[125,3,127,3],[125,4,127,4],[27,5,35,5],[27,6,35,6],[77,2,79,2],[77,3,79,3],[77,4,79,4],[77,5,79,5],[77,6,79,6],[99,2,102,2],[99,3,102,3],[99,4,102,4],[99,5,102,5],[99,6,102,6],[1,2,5,2],[1,3,5,3],[1,4,5,4],[27,2,35,2],[27,3,35,3],[27,4,35,4]]}
[null,"訪問系","支給単位","都市ガスを利用している場合","プロパンガスを利用している場合"]
[null,"居宅介護","１事業所当たり",4100,3600]
[null,"重度訪問介護"]
[null,"同行援護"]
[null,"行動援護"]
[null,"重度障害者等包括支援"]
[]
["key","訪問系","高圧・低圧","都市ガス・プロパンガス","金額"]
[{"$f":"B9&D9","v":"居宅介護都市ガス"},"居宅介護","-","都市ガス",4100]
[{"$f":"B10&D10","v":"居宅介護プロパンガス"},"居宅介護","-","プロパンガス",3600]
["重度訪問介護都市ガス","重度訪問介護","-","都市ガス",4100]
["重度訪問介護プロパンガス","重度訪問介護","-","プロパンガス",3600]
["同行援護都市ガス","同行援護","-","都市ガス",4100]
["同行援護プロパンガス","同行援護","-","プロパンガス",3600]
["行動援護都市ガス","行動援護","-","都市ガス",4100]
["行動援護プロパンガス","行動援護","-","プロパンガス",3600]
["重度障害者等包括支援都市ガス","重度障害者等包括支援","-","都市ガス",4100]
["重度障害者等包括支援プロパンガス","重度障害者等包括支援","-","プロパンガス",3600]
["児訪問系都市ガス","児訪問系","-","都市ガス",4100]
["児訪問系プロパンガス","児訪問系","-","プロパンガス",3600]
["居宅訪問型児童発達支援都市ガス","居宅訪問型児童発達支援","-","都市ガス",4100]
["居宅訪問型児童発達支援プロパンガス","居宅訪問型児童発達支援","-","プロパンガス",3600]
["保育所等訪問支援都市ガス","保育所等訪問支援","-","都市ガス",4100]
["保育所等訪問支援プロパンガス","保育所等訪問支援","-","プロパンガス",3600]
[]
[]
[null,"通所系","支給単位","高圧かつ都市ガスを利用している場合","高圧かつプロパンガスを利用している場合","低圧かつ都市ガスを利用している場合","低圧かつプロパンガスを利用している場合"]
[null,"生活介護","１事業所当たり",61100,73600,17400,29900]
[null,"短期入所（単独型）"]
[null,"療養介護"]
[null,"自立訓練（機能訓練）"]
[null,"自立訓練（生活訓練）"]
[null,"自立訓練（宿泊型）",null,null,null,null,null,null,73600,17400,29900]
[null,"就労移行支援"]
[null,"就労継続支援Ａ型"]
[null,"就労継続支援Ｂ型"]
[]
["key","通所系","高圧・低圧","都市ガス・プロパンガス","金額"]
[{"$f":"B39&C39&D39","v":"生活介護高圧都市ガス"},"生活介護","高圧","都市ガス",61100]
[{"$f":"B40&C40&D40","v":"生活介護高圧プロパンガス"},"生活介護","高圧","プロパンガス",73600]
{"$rows_left_out":107}