{"text_format":"1","workbook":"xlsx","n_sheets":14,"sheets":["①交付申請書","②-1申請額算出内訳（入所支援施設） (2)","②-2申請額算出内訳 （共同生活援助系) (2)","②-3申請額算出内訳 (児・者通所系) (2)","②-4申請額算出内訳 (児・者訪問系)","訪問系のガソリン区分計算表（別紙1-5）","③口座振替申出書","④口座の写し添付用シート","⑤光熱費申出書","⑥電気・ガスの契約種別がわかるもの","請求書","交付金checklist","食事提供加算有","食事提供加算無"],"not_rendered":{"charts":0,"images":0,"macros":1,"external_links":5,"defined_names":37,"comments":6,"pivot_tables":0},"unopened":[],"bounds":{"document_bytes":16777216,"sheet_cells":100000,"rows_first":2000,"rows_last":500,"rows_between":2000,"halvings":0,"cell_chars":16384,"cell_head_chars":4096},"cells_cut":0,"cells_raw":0,"read":"whole","date_system":"1900"}

{"sheet":"①交付申請書","index":0,"n_rows":38,"n_cols":7,"rows_kept":38,"cut":false,"hidden":false,"merged":[[6,0,6,7],[1,0,1,7],[2,0,2,7],[3,0,3,7],[0,0,0,7],[4,0,4,7],[5,0,5,7],[7,0,7,7],[8,0,8,7],[9,0,9,7],[10,0,10,7],[29,3,29,7],[11,5,11,7],[37,5,37,7],[12,5,12,7],[13,5,13,7],[14,5,14,7],[23,4,23,5],[28,0,28,7],[27,0,27,2],[27,3,27,7],[15,0,15,7],[16,0,16,7],[12,0,12,4],[13,0,13,4],[14,0,14,4],[31,0,31,7],[32,0,32,7],[19,0,19,7],[34,5,34,7],[35,5,35,7],[36,5,36,7],[11,0,11,4],[20,0,20,7],[21,0,21,7],[22,0,22,7],[17,0,17,7],[18,0,18,7],[23,0,23,2],[25,0,25,2],[25,3,25,7],[24,0,24,7],[26,0,26,7],[29,0,29,2]]}
["様式第１号（第６条関係）"]
[]
["埼玉県障害福祉サービス事業所等光熱費等高騰対策支援事業補助金"]
["交付申請書"]
[]
["第　　　　　号"]
["令和　年　月　日"]
[]
["（宛先）"]
["  埼玉県知事"]
[]
["（申請者）"]
["所　 在 　地"]
["法人等の名称"]
["代表者職氏名"]
[]
[]
["　下記により、埼玉県障害福祉サービス事業所等光熱費等高騰対策支援事業補助金の"]
["事業補助金の交付を受けたいので、補助金等の交付手続等に関する規則第４条の規定によ"]
["り、関係書類を添えて申請します。"]
[]
["記"]
[]
["１　補助金交付申請額",null,null,"金",{"$f":"'②-1申請額算出内訳（入所支援施設） (2)'!M27+'②-2申請額算出内訳 （共同生活援助系) (2)'!N27+'②-3申請額算出内訳 (児・者通所系) (2)'!N27+'②-4申請額算出内訳 (児・者訪問系)'!M27","v":0},null,"円"]
[]
["２　申請額算出内訳",null,null,"別紙１のとおり"]
[]
["３　口座振込申出書",null,null,"別紙２のとおり"]
[]
["４　光熱費に係る種別の申出書",null,null,"別紙３のとおり"]
{"$rows_left_out":9}
{"sheet":"②-1申請額算出内訳（入所支援施設） (2)","index":1,"n_rows":31,"n_cols":13,"rows_kept":31,"cut":false,"hidden":false,"merged":[[0,7,0,8],[0,9,0,10],[2,0,2,10],[4,7,4,10]]}
["別紙１－１（児・者入所支援施設）",null,null,null,null,null,null,"申請者(法人）名：　　　　　　　　　　　　　　　　　　　　",null,{"$f":"①交付申請書!F14","v":0}]
[]
["申　　請　　額　　算　　出　　内　　訳"]
[]
[]
["№","事業所番号","施設・事業所名","住所\n（市・町名）","住所２（区名以下）","サービス種別","事業開始日","　　交付対象数（A）\n入所施設　➡　定員数","交付単位\n人\n事業所\n住居","ガス","補助単価\n(B)","プロパンガスの場合、控除","申請額\n(A×B)"]
["記入例\n1",2222222222,"世界埼玉にゅうしょ施設","縄文市","南区まがたま町１－２－３","福祉型障害児入所施設","2044-01-01",55,"人","プロパンガス",{"$f":"VLOOKUP(F7&J7,食事提供加算有!A:E,5,FALSE)","v":18700},{"$f":"VLOOKUP(F7&J7,食事提供加算有!A:F,6,FALSE)","v":1500},{"$f":"H7*K7-L7","v":1027000}]
["記入例２",1111222222,"川口にゅうしょ施設","AB市","南区南町１－２－３","医療型障害児入所施設","2016-01-01",40,"人","プロパンガス",{"$f":"VLOOKUP(F8&J8,食事提供加算有!A:E,5,FALSE)","v":18700},{"$f":"VLOOKUP(F8&J8,食事提供加算有!A:F,6,FALSE)","v":1500},{"$f":"H8*K8-L8","v":746500}]
[1,null,null,null,null,null,null,null,null,null,null,null,{"$f":"H9*K9-L9","v":0}]
[2,null,null,null,null,null,null,null,null,null,null,null,{"$f":"H10*K10-L10","v":0}]
[3]
[4]
[5,null,null,null,null,null,null,null,null,null,null,null,{"$f":"H13*K13-L13","v":0}]
[6]
[7,null,null,null,null,null,null,null,null,null,null,null,0]
[8,null,null,null,null,null,null,null,null,null,null,null,0]
[9,null,null,null,null,null,null,null,null,null,null,null,0]
[10,null,null,null,null,null,null,null,null,null,null,null,0]
[11,null,null,null,null,null,null,null,null,null,null,null,0]
[12,null,null,null,null,null,null,null,null,null,null,null,0]
[13,null,null,null,null,null,null,null,null,null,null,null,0]
[14,null,null,null,null,null,null,null,null,null,null,null,0]
[15,null,null,null,null,null,null,null,null,null,null,null,0]
[16,null,null,null,null,null,null,null,null,null,null,null,0]
[17,null,null,null,null,null,null,null,null,null,null,null,0]
[18,null,null,null,null,null,null,null,null,null,null,null,0]
[null,null,null,null,null,null,null,null,null,null,null,"合計",{"$f":"SUM(M9:M26)","v":0}]
[]
["※事業所番号が未記入あるいは誤った番号を記載した場合は対象外となるので誤記などないよう十分に注意すること。"]
["※「サービス種別」欄は、補助要綱別表１に掲げる種別を記載すること。"]
{"$rows_left_out":2}
{"sheet":"②-2申請額算出内訳 （共同生活援助系) (2)","index":2,"n_rows":31,"n_cols":20,"rows_kept":31,"cut":false,"hidden":false,"merged":[[0,7,0,8],[0,9,0,13],[2,0,2,13],[4,7,4,13]]}
["別紙１－２（共同生活援助系）",null,null,null,null,null,null,"申請者(法人）名：　　　　　　　　　　　　　　　　　　　　",null,{"$f":"①交付申請書!F14","v":0}]
[]
["申　　請　　額　　算　　出　　内　　訳"]
[]
[]
["№","事業所番号","グループホームの住居名\n※住居毎に記載","住所\n（市・町名）","住所２（区名以下）","サービス種別","事業開始日","　　交付対象数（A）\nＧＨ➡１住居の定員数（1住居5人以下の場合は一律6人）","交付単位\n人","電力\n（訪問、入所施設は記入不要）","ガス","補助単価\n(B)","プロパンガスの場合、控除","申請額\n(A×B)"]
["記入例",1111111111,"大宮グループホーム１","大和市","北区さいたま町１－２－３","共同生活援助（介護サービス包括型）","2043-01-01",10,"人","高圧","都市ガス",{"$f":"VLOOKUP(F7&J7&K7,食事提供加算無!A:E,5,FALSE)","v":7300},{"$f":"VLOOKUP(F7&J7&K7,食事提供加算無!A:F,6,FALSE)","v":0},{"$f":"H7*L7-M7","v":73000}]
["記入例\n２",2222222222,"大宮グループホーム２","大和市","南区まがたま町１－２－３","共同生活援助（介護サービス包括型）","2044-01-01",6,"人","低圧","プロパンガス",{"$f":"VLOOKUP(F8&J8&K8,食事提供加算無!A:E,5,FALSE)","v":5200},{"$f":"VLOOKUP(F8&J8&K8,食事提供加算無!A:F,6,FALSE)","v":1500},29700]
[1,null,null,null,null,null,null,null,null,null,null,null,null,{"$f":"H9*L9-M9","v":0},null,null,null,null,null,"共同生活援助（指定共同生活援助）"]
[2,null,null,null,null,null,null,null,null,null,null,null,null,null,null,null,null,null,null,"共同生活援助（日中サービス支援型）"]
[3,null,null,null,null,null,null,null,null,null,null,null,null,null,null,null,null,null,null,"共同生活援助（外部サービス利用型）"]
[4]
[5]
[6]
[7]
[8]
[9]
[10]
[11]
[12,null,null,null,null,null,null,null,null,null,null,null,null,{"$f":"H20*L20-M20","v":0}]
[13,null,null,null,null,null,null,null,null,null,null,null,null,{"$f":"H21*L21-M21","v":0}]
[14,null,null,null,null,null,null,null,null,null,null,null,null,0]
[15,null,null,null,null,null,null,null,null,null,null,null,null,0]
[16,null,null,null,null,null,null,null,null,null,null,null,null,0]
[17,null,null,null,null,null,null,null,null,null,null,null,null,0]
[18]
[null,null,null,null,null,null,null,null,null,null,null,"合計",null,{"$f":"SUM(N9:N26)","v":0}]
[]
["※事業所番号が未記入あるいは誤った番号を記載した場合は対象外となるので誤記などないよう十分に注意すること。"]
["※「サービス種別」欄は、補助要綱別表１に掲げる種別を記載すること。"]
{"$rows_left_out":2}
{"sheet":"②-3申請額算出内訳 (児・者通所系) (2)","index":3,"n_rows":31,"n_cols":19,"rows_kept":31,"cut":false,"hidden":false,"merged":[[0,7,0,8],[0,9,0,13],[2,0,2,13],[4,7,4,13]]}
["別紙１－３（児・者通所系）",null,null,null,null,null,null,"申請者(法人）名：　　　　　　　　　　　　　　　　　　　　",null,{"$f":"①交付申請書!F14","v":0}]
[]
["申　　請　　額　　算　　出　　内　　訳"]
[]
[]
["№","事業所番号","施設・事業所名","住所\n（市・町名）","住所２（区名以下）","サービス種別","事業開始日","　　交付対象数（A）\n通所・訪問➡　事業所数","交付単位\n人\n事業所\n住居","食事提供体制加算\n（児通所は児童発達支援センターのみ。食事提供加算を請求している場合）","電力\n（訪問、入所施設は記入不要）","ガス","補助単価\n(B)","申請額\n(A×B)"]
["記入例",1111111111,"世界さいたま事業所","大和市","北区さいたま町１－２－３","就労移行支援","2043-01-01",1,"事業所","有","高圧","都市ガス",{"$f":"VLOOKUP(F7&K7&L7,食事提供加算有!A:F,5,FALSE)","v":218100},{"$f":"H7*M7","v":218100}]
["記入例\n２",2222222222,"さいたま放課後等デイサービス","縄文市","南区まがたま町１－２－３","児童発達支援","2044-01-01",1,"事業所","無","低圧","プロパンガス",{"$f":"VLOOKUP(F8&K8&L8,食事提供加算無!A:F,5,FALSE)","v":29600},{"$f":"H8*M8","v":29600}]
[1,null,null,null,null,null,null,null,null,null,null,null,null,{"$f":"H9*M9","v":0},null,null,null,null,"生活介護"]
[2,null,null,null,null,null,null,null,null,null,null,null,null,null,null,null,null,null,"短期入所（単独型）"]
[3,null,null,null,null,null,null,null,null,null,null,null,null,null,null,null,null,null,"療養介護"]
[4,null,null,null,null,null,null,null,null,null,null,null,null,null,null,null,null,null,"自立訓練（機能訓練）"]
[5,null,null,null,null,null,null,null,null,null,null,null,null,null,null,null,null,null,"自立訓練（生活訓練）"]
[6,null,null,null,null,null,null,null,null,null,null,null,null,{"$f":"H14*M14","v":0},null,null,null,null,"自立訓練（宿泊型）"]
[7,null,null,null,null,null,null,null,null,null,null,null,null,0,null,null,null,null,"就労移行支援"]
[8,null,null,null,null,null,null,null,null,null,null,null,null,0,null,null,null,null,"就労継続支援Ａ型"]
[9,null,null,null,null,null,null,null,null,null,null,null,null,0,null,null,null,null,"就労継続支援Ｂ型"]
[10,null,null,null,null,null,null,null,null,null,null,null,null,0,null,null,null,null,"児童発達支援"]
[11,null,null,null,null,null,null,null,null,null,null,null,null,0,null,null,null,null,"児童発達支援センター"]
[12,null,null,null,null,null,null,null,null,null,null,null,null,0,null,null,null,null,"医療型児童発達支援センター"]
[13,null,null,null,null,null,null,null,null,null,null,null,null,0,null,null,null,null,"放課後等デイサービス"]
[14,null,null,null,null,null,null,null,null,null,null,null,null,0]
[15,null,null,null,null,null,null,null,null,null,null,null,null,0]
[16,null,null,null,null,null,null,null,null,null,null,null,null,0]
[17,null,null,null,null,null,null,null,null,null,null,null,null,0]
[18,null,null,null,null,null,null,null,null,null,null,null,null,0]
[null,null,null,null,null,null,null,null,null,null,null,null,"合計",{"$f":"SUM(N9:N26)","v":0}]
[]
["※事業所番号が未記入あるいは誤った番号を記載した場合は対象外となるので誤記などないよう十分に注意すること。"]
["※「サービス種別」欄は、補助要綱別表１に掲げる種別を記載すること。"]
{"$rows_left_out":2}
{"sheet":"②-4申請額算出内訳 (児・者訪問系)","index":4,"n_rows":31,"n_cols":16,"rows_kept":31,"cut":false,"hidden":false,"merged":[[0,7,0,8],[0,9,0,12],[2,0,2,12],[4,7,4,12]]}
["別紙１－４（児・者訪問系）",null,null,null,null,null,null,"申請者(法人）名：　　　　　　　　　　　　　　　　　　　　",null,{"$f":"①交付申請書!F14","v":0}]
[]
["申　　請　　額　　算　　出　　内　　訳"]
[]
[]
["№","事業所番号","施設・事業所名","住所\n（市・町名）","住所２（区名以下）","サービス種別","事業開始日","　　交付対象数（A）\n通所・訪問➡　事業所数","交付単位\n人\n事業所\n住居","ガス","1人当たりの平均移動距離/日","補助単価\n(B)","申請額\n(A×B)"]
["記入例",1111111111,"世界さいたま事業所","大和市","北区さいたま町１－２－３","居宅介護","2043-01-01",1,"事業所","都市ガス","12㌔未満",{"$f":"_xlfn.IFNA(VLOOKUP(F7&J7&K7,食事提供加算無!A7:F38,6,FALSE),\"該当なし\")","v":18300},{"$f":"L7","v":18300}]
["記入例\n２",2222222222,"さいたま放課後等訪問支援","縄文市","南区まがたま町１－２－３","保育所等訪問支援","2044-01-01",1,"事業所","プロパンガス","12㌔～22㌔未満",{"$f":"_xlfn.IFNA(VLOOKUP(F8&J8&K8,食事提供加算無!A8:F57,6,FALSE),\"該当なし\")","v":24900},24900]
[1,null,null,null,null,null,null,null,null,null,null,{"$f":"_xlfn.IFNA(VLOOKUP(F9&J9&K9,食事提供加算無!$A$9:$F$58,6,FALSE),\"該当なし\")","v":"該当なし"},{"$f":"L9","v":"該当なし"},null,null,"居宅介護"]
[2,null,null,null,null,null,null,null,null,null,null,{"$f":"_xlfn.IFNA(VLOOKUP(F10&J10&K10,食事提供加算無!$A$9:$F$58,6,FALSE),\"該当なし\")","v":"該当なし"},{"$f":"L10","v":"該当なし"},null,null,"重度訪問介護"]
[3,null,null,null,null,null,null,null,null,null,null,{"$f":"_xlfn.IFNA(VLOOKUP(F11&J11&K11,食事提供加算無!$A$9:$F$58,6,FALSE),\"該当なし\")","v":"該当なし"},"該当なし",null,null,"同行援護"]
[4,null,null,null,null,null,null,null,null,null,null,{"$f":"_xlfn.IFNA(VLOOKUP(F12&J12&K12,食事提供加算無!$A$9:$F$58,6,FALSE),\"該当なし\")","v":"該当なし"},"該当なし",null,null,"行動援護"]
[5,null,null,null,null,null,null,null,null,null,null,{"$f":"_xlfn.IFNA(VLOOKUP(F13&J13&K13,食事提供加算無!$A$9:$F$58,6,FALSE),\"該当なし\")","v":"該当なし"},"該当なし",null,null,"重度障害者等包括支援"]
[6,null,null,null,null,null,null,null,null,null,null,{"$f":"_xlfn.IFNA(VLOOKUP(F14&J14&K14,食事提供加算無!$A$9:$F$58,6,FALSE),\"該当なし\")","v":"該当なし"},"該当なし",null,null,"居宅訪問型児童発達支援"]
[7,null,null,null,null,null,null,null,null,null,null,{"$f":"_xlfn.IFNA(VLOOKUP(F15&J15&K15,食事提供加算無!$A$9:$F$58,6,FALSE),\"該当なし\")","v":"該当なし"},"該当なし",null,null,"保育所等訪問支援"]
[8,null,null,null,null,null,null,null,null,null,null,{"$f":"_xlfn.IFNA(VLOOKUP(F16&J16&K16,食事提供加算無!$A$9:$F$58,6,FALSE),\"該当なし\")","v":"該当なし"},"該当なし",null,null,"児訪問系"]
[9,null,null,null,null,null,null,null,null,null,null,{"$f":"_xlfn.IFNA(VLOOKUP(F17&J17&K17,食事提供加算無!$A$9:$F$58,6,FALSE),\"該当なし\")","v":"該当なし"},"該当なし"]
[10,null,null,null,null,null,null,null,null,null,null,{"$f":"_xlfn.IFNA(VLOOKUP(F18&J18&K18,食事提供加算無!$A$9:$F$58,6,FALSE),\"該当なし\")","v":"該当なし"},"該当なし"]
[11,null,null,null,null,null,null,null,null,null,null,{"$f":"_xlfn.IFNA(VLOOKUP(F19&J19&K19,食事提供加算無!$A$9:$F$58,6,FALSE),\"該当なし\")","v":"該当なし"},"該当なし"]
[12,null,null,null,null,null,null,null,null,null,null,{"$f":"_xlfn.IFNA(VLOOKUP(F20&J20&K20,食事提供加算無!$A$9:$F$58,6,FALSE),\"該当なし\")","v":"該当なし"},"該当なし"]
[13,null,null,null,null,null,null,null,null,null,null,{"$f":"_xlfn.IFNA(VLOOKUP(F21&J21&K21,食事提供加算無!$A$9:$F$58,6,FALSE),\"該当なし\")","v":"該当なし"},"該当なし"]
[14,null,null,null,null,null,null,null,null,null,null,{"$f":"_xlfn.IFNA(VLOOKUP(F22&J22&K22,食事提供加算無!$A$9:$F$58,6,FALSE),\"該当なし\")","v":"該当なし"},"該当なし"]
[15,null,null,null,null,null,null,null,null,null,null,{"$f":"_xlfn.IFNA(VLOOKUP(F23&J23&K23,食事提供加算無!$A$9:$F$58,6,FALSE),\"該当なし\")","v":"該当なし"},"該当なし"]
[16,null,null,null,null,null,null,null,null,null,null,{"$f":"_xlfn.IFNA(VLOOKUP(F24&J24&K24,食事提供加算無!$A$9:$F$58,6,FALSE),\"該当なし\")","v":"該当なし"},"該当なし"]
[17,null,null,null,null,null,null,null,null,null,null,{"$f":"_xlfn.IFNA(VLOOKUP(F25&J25&K25,食事提供加算無!$A$9:$F$58,6,FALSE),\"該当なし\")","v":"該当なし"},"該当なし"]
[18,null,null,null,null,null,null,null,null,null,null,{"$f":"_xlfn.IFNA(VLOOKUP(F26&J26&K26,食事提供加算無!$A$9:$F$58,6,FALSE),\"該当なし\")","v":"該当なし"},"該当なし"]
[null,null,null,null,null,null,null,null,null,null,null,"合計",{"$f":"SUM(M9:M26)","v":0}]
[]
["※事業所番号が未記入あるいは誤った番号を記載した場合は対象外となるので誤記などないよう十分に注意すること。"]
["※「サービス種別」欄は、補助要綱別表１に掲げる種別を記載すること。"]
{"$rows_left_out":2}
{"sheet":"訪問系のガソリン区分計算表（別紙1-5）","index":5,"n_rows":49,"n_cols":5,"rows_kept":49,"cut":false,"hidden":false,"merged":[[3,1,3,2],[3,3,3,4],[4,1,4,2],[4,3,4,4]]}
["別紙1-5"]
["〇訪問系のガソリン区分計算表（別紙1-5）　※複数事業所がある場合はシートをコピーして使用してください。"]
["１．事業所情報"]
["事業所番号","事業所名",null,"サービス種別"]
[]
[]
["２．ガソリン区分"]
["1日の平均\n移動距離\n（常勤換算\n1人あたり）\n（㎞）","ガソリン区分"]
[{"$f":"ROUNDUP(E43/B43,0)","v":{"$error":"#DIV/0!"}},{"$f":"IF(A9<12,食事提供加算無!A179,IF(AND(A9>=12,A9<22),食事提供加算無!A180,食事提供加算無!A181))","v":{"$error":"#DIV/0!"}}]
[]
["３．計算シート"]
[null,"常勤\n換算数","令和7年3月の\n訪問に係る\n総移動距離\n（㎞）","令和7年3月\nの勤務日数\n（日）","1日あたりの\n移動距離\n（㎞）"]
["介護職員1",null,null,null,{"$f":"IFERROR(ROUNDUP(C13/D13,0),0)","v":0}]
["介護職員2",null,null,null,{"$f":"IFERROR(ROUNDUP(C14/D14,0),0)","v":0}]
["介護職員3",null,null,null,0]
["介護職員4",null,null,null,0]
["介護職員5",null,null,null,0]
["介護職員6",null,null,null,0]
["介護職員7",null,null,null,0]
["介護職員8",null,null,null,0]
["介護職員9",null,null,null,0]
["介護職員10",null,null,null,0]
["介護職員11",null,null,null,0]
["介護職員12",null,null,null,0]
["介護職員13",null,null,null,0]
["介護職員14",null,null,null,0]
["介護職員15",null,null,null,0]
["介護職員16",null,null,null,0]
["介護職員17",null,null,null,0]
["介護職員18",null,null,null,0]
{"$rows_left_out":20}
{"sheet":"③口座振替申出書","index":6,"n_rows":24,"n_cols":9,"rows_kept":24,"cut":false,"hidden":false,"merged":[[11,0,11,12],[8,0,8,5],[9,0,9,5],[10,0,10,5],[8,6,8,7],[9,6,9,7],[10,6,10,7],[8,8,8,12],[9,8,9,12],[10,8,10,12],[19,4,19,6],[12,0,12,12],[16,0,16,12],[13,0,13,12],[14,0,14,12],[23,0,23,12],[2,0,2,12],[0,0,0,12],[3,0,3,12],[6,0,6,12],[1,0,1,12],[4,0,4,12],[5,0,5,12],[20,4,20,12],[21,4,21,12],[7,0,7,12],[17,8,17,10],[18,8,18,10],[19,8,19,10],[17,4,17,6],[18,4,18,6]]}
["別紙２"]
[]
["埼玉県障害福祉サービス事業所等光熱費等高騰対策支援事業"]
["補助金口座振込申出書"]
[]
["（宛先）"]
["埼玉県知事　大野　元裕"]
[]
[null,null,null,null,null,null,"住　　　　所",null,{"$f":"①交付申請書!F13","v":0}]
[null,null,null,null,null,null,"法人等の名称",null,{"$f":"①交付申請書!F14","v":0}]
[null,null,null,null,null,null,"代表者職氏名",null,{"$f":"①交付申請書!F15","v":0}]
[]
["令和　年　月　日付けで申請した標記補助金について、交付決定を受けた"]
["場合、下記口座に振り込んでください。"]
["記"]
[]
[]
[null,null,"金融機関名",null,null,null,null,null,"金融機関コード"]
[null,null,"支店名",null,null,null,null,null,"支店コード"]
[null,null,"口座種別",null,null,null,null,null,"口座番号"]
[null,null,"口座名義(漢字)"]
[null,null,"口座名義(カナ)"]
[]
["※補助金の振込を希望する金融機関の口座名義、金融機関名、支店名、及び口座\n　番号等を確認できる通帳等の写しを添付すること。"]

{"sheet":"④口座の写し添付用シート","index":7,"n_rows":0,"n_cols":0,"rows_kept":0,"cut":false,"hidden":false,"merged":[]}

{"sheet":"⑤光熱費申出書","index":8,"n_rows":93,"n_cols":9,"rows_kept":93,"cut":false,"hidden":false,"merged":[[82,3,82,10],[82,11,84,12],[83,3,83,10],[84,3,84,10],[86,3,86,10],[86,11,88,12],[87,3,87,10],[88,3,88,10],[42,3,42,10],[42,11,43,12],[43,3,43,10],[45,3,45,10],[45,11,46,12],[46,3,46,10],[36,3,36,10],[36,11,37,12],[37,3,37,10],[39,3,39,10],[39,11,40,12],[40,3,40,10],[27,11,28,12],[28,3,28,10],[30,3,30,10],[30,11,31,12],[31,3,31,10],[27,3,27,10],[33,11,34,12],[34,3,34,10],[74,3,74,10],[74,11,76,12],[75,3,75,10],[76,3,76,10],[58,3,58,10],[58,11,60,12],[59,3,59,10],[60,3,60,10],[62,3,62,10],[62,11,64,12],[63,3,63,10],[64,3,64,10],[50,3,50,10],[50,11,52,12],[54,3,54,10],[54,11,56,12],[48,0,48,12],[78,3,78,10],[78,11,80,12],[79,3,79,10],[80,3,80,10],[66,3,66,10],[66,11,68,12],[67,3,67,10],[68,3,68,10],[70,3,70,10],[70,11,72,12],[71,3,71,10],[72,3,72,10],[90,0,90,12],[91,0,91,12],[18,3,18,10],[18,11,19,12],[19,3,19,10],[21,11,22,12],[24,3,24,10],[24,11,25,12],[55,3,55,10],[56,3,56,10],[33,3,33,10],[25,3,25,10],[21,3,21,10],[22,3,22,10],[51,3,51,10],[52,3,52,10],[14,0,14,12],[15,0,15,12],[16,0,16,12],[10,0,10,5],[10,6,10,7],[10,8,10,12],[11,0,11,12],[12,0,12,12],[13,0,13,12],[9,0,9,5],[9,6,9,7],[9,8,9,12],[0,0,0,12],[1,0,1,12],[2,0,2,12],[3,0,3,12],[4,0,4,12],[5,0,5,12],[6,0,6,12],[7,0,7,12],[8,0,8,5],[8,6,8,7],[8,8,8,12]]}
["別紙３"]
[]
["埼玉県障害福祉サービス事業所（又は住居）等光熱費等高騰対策"]
["支援事業補助金光熱費に係る種別の申出書"]
[]
["（宛先）"]
["埼玉県知事　大野　元裕"]
[]
[null,null,null,null,null,null,"住　　　　所",null,{"$f":"①交付申請書!F13","v":0}]
[null,null,null,null,null,null,"法人等の名称",null,{"$f":"①交付申請書!F14","v":0}]
[null,null,null,null,null,null,"代表者職氏名",null,{"$f":"①交付申請書!F15","v":0}]
[]
["令和　年　月　日付けで申請した標記補助金について、事業所（又は住居）等の光熱費の種別"]
["は下記のとおりです。"]
[]
["記"]
["１　令和５年度第１回又は第２回補助金を申請した事業所（又は住居）"]
[null,null,"　光熱費の契約内容に変更無の場合、添付書類（電気、ガスの明細書等）の提出は不要です。"]
[null,null,"事業所（又は住居）名"]
[null,null,"変更の有無"]
[]
[null,null,"事業所（又は住居）名"]
[null,null,"変更の有無"]
[]
[null,null,"事業所（又は住居）名"]
[null,null,"変更の有無"]
[]
[null,null,"事業所（又は住居）名"]
[null,null,"変更の有無"]
[]
{"$rows_left_out":64}
{"sheet":"⑥電気・ガスの契約種別がわかるもの","index":9,"n_rows":31,"n_cols":1,"rows_kept":31,"cut":false,"hidden":false,"merged":[]}
[]
["１　電力　（高圧　又は　低圧　が分かるもの）"]
[]
[]
[]
[]
[]
[]
[]
[]
[]
[]
[]
[]
[]
[]
[]
[]
[]
[]
[]
[]
[]
[]
[]
[]
[]
[]
[]
[]
{"$rows_left_out":2}
{"sheet":"請求書","index":10,"n_rows":36,"n_cols":7,"rows_kept":36,"cut":false,"hidden":false,"merged":[[11,0,11,4],[11,5,11,7],[0,0,0,7],[1,0,1,7],[2,0,2,7],[3,0,3,7],[4,0,4,7],[5,0,5,7],[6,0,6,7],[7,0,7,7],[8,0,8,7],[9,0,9,7],[10,0,10,7],[12,0,12,4],[12,5,12,7],[13,0,13,4],[13,5,13,7],[14,0,14,4],[14,5,14,7],[25,0,25,2],[25,3,25,7],[15,0,15,7],[16,0,16,7],[17,0,17,7],[18,0,18,7],[19,0,19,7],[20,0,20,7],[21,0,21,7],[22,0,22,7],[23,0,23,2],[23,4,23,5],[24,0,24,7],[32,5,32,7],[33,5,33,7],[34,5,34,7],[35,5,35,7],[26,0,26,7],[27,0,27,2],[27,3,27,7],[28,0,28,7],[29,0,29,7],[30,0,30,7]]}
["参考"]
[]
["埼玉県障害福祉サービス事業所等光熱費等高騰対策支援事業"]
["補助金請求書"]
[]
[]
[{"$f":"①交付申請書!A7","v":"令和　年　月　日"}]
[]
["（宛先）"]
["  埼玉県知事"]
[]
["（申請者）"]
["所　 在 　地",null,null,null,null,{"$f":"①交付申請書!F13","v":0}]
["法人等の名称",null,null,null,null,{"$f":"①交付申請書!F14","v":0}]
["代表者職氏名",null,null,null,null,{"$f":"①交付申請書!F15","v":0}]
[]
[]
["　下記により、埼玉県障害福祉サービス事業所等光熱費等高騰対策支援事業補助金"]
["の交付確定通知を受けたので、該当する補助金額を請求します。"]
[]
[]
["記"]
[]
["１　補助金請求額",null,null,"金",{"$f":"①交付申請書!E24","v":0},null,"円"]
[]
[]
[]
[]
[]
[]
{"$rows_left_out":7}
{"sheet":"交付金checklist","index":11,"n_rows":43,"n_cols":26,"rows_kept":43,"cut":false,"hidden":false,"merged":[[37,34,37,35],[31,2,31,35],[34,1,34,34],[36,3,36,4],[36,6,36,7],[36,9,36,10],[37,13,37,15],[37,16,37,17],[37,18,37,22],[37,23,37,24],[37,25,37,33],[24,2,24,33],[25,2,25,33],[36,13,36,15],[36,16,36,35],[28,2,28,33],[26,2,26,33],[27,2,27,33],[15,0,15,35],[13,0,13,5],[14,0,14,5],[13,6,13,22],[13,23,13,25],[13,26,13,35],[14,6,14,8],[14,19,14,21],[14,22,14,35],[14,9,14,18],[9,0,11,5],[9,7,9,11],[10,6,10,35],[11,6,11,35],[12,0,12,5],[9,12,9,35],[12,23,12,35],[0,25,0,35],[3,0,3,35],[7,0,7,5],[7,6,7,35],[8,0,8,5],[8,6,8,35],[0,22,0,24],[19,2,19,33],[20,2,20,33],[21,2,21,33],[18,1,18,33],[23,2,23,33],[22,2,22,33]]}
[null,null,null,null,null,null,null,null,null,null,null,null,null,null,null,null,null,null,null,null,null,null,"No.",null,null,{"$f":"IF([5]基本情報入力シート!R11=\"\",\"\",[5]基本情報入力シート!R11)","v":""}]
[]
[]
["埼玉県障害福祉サービス事業所等光熱費等高騰対策支援事業補助金チェックリスト"]
[]
["◎　基本情報"]
[]
["フリガナ"]
["法人名",null,null,null,null,null,{"$f":"①交付申請書!F14","v":0}]
["法人所在地",null,null,null,null,null,"〒"]
[null,null,null,null,null,null,{"$f":"①交付申請書!F13","v":0}]
[]
["フリガナ"]
["書類作成担当者",null,null,null,null,null,null,null,null,null,null,null,null,null,null,null,null,null,null,null,null,null,null,"電話番号"]
["連絡先",null,null,null,null,null,"FAX番号",null,null,null,null,null,null,null,null,null,null,null,null,"E-mail"]
["※連絡先は必ず日中連絡できる電話番号を記載すること。不明な点等があれば事務局から問い合わせがあります。"]
[null,"以下の点を確認し、全ての項目にチェックして下さい。"]
[null,"　　　※（チェックできない項目があれば申請内容の修正が必要です。見直してください）"]
[null,"確認項目"]
[null,null,"令和７年３月１日時点で県から障害福祉サービス事業所、障害児者支援施設の指定を受けています。"]
[null,null,"令和７年３月１日時点で事業の休止、廃止はしていません。"]
[null,null,"補助金申請に必要な資料はすべて添付しています。"]
[null,null,"申請額算出内訳表には、必要な項目がすべて記載しています。"]
[null,null,"（提供サービスが異なっていても同じ住所地の事業所は申請できません。）\n同じ住所の事業所で２重申請はしていません。"]
[null,null,"（提供サービスが異なっていても同じ住所地の事業所は申請できません。高齢者等に対する訪問介護等も含みます。）\n同じ住所の事業所で２重申請はしていません。"]
[null,null,"（訪問系及び入所支援施設は確認不要）\n電力（高圧又は低圧）の選択に誤りはありません。"]
[null,null,"ガス（都市ガス又はプロパンガス）の選択に誤りはありません。"]
[null,null,"（訪問系の事業所は）介護職員1人当たりの平均移動距離／日の選択に誤りはありません。"]
[null,null,"（障害児通所で食事有を選択する場合）\n児童発達支援センターであり、令和７年３月１日時点で食事提供加算を請求しており、３月３１日まで継続する。"]
[]
{"$rows_left_out":14}
{"sheet":"食事提供加算有","index":12,"n_rows":75,"n_cols":13,"rows_kept":75,"cut":false,"hidden":true,"merged":[[64,2,66,2],[64,3,66,3],[64,4,66,4],[48,1,49,1],[48,2,51,2],[48,3,51,3],[48,4,51,4],[48,5,51,5],[48,6,51,6],[50,1,51,1],[1,2,9,2],[1,3,9,3],[1,4,9,4],[1,5,9,5],[1,6,9,6],[2,1,3,1]]}
[null,"通所系","支給単位","高圧かつ都市ガスを利用している場合","高圧かつプロパンガスを利用している場合","低圧かつ都市ガスを利用している場合","低圧かつプロパンガスを利用している場合","児・者　入所支援施設"]
[null,"生活介護","１事業所当たり",{"$f":"食事提供加算無!D62+140600","v":218100},{"$f":"食事提供加算無!E62+140600","v":219500},{"$f":"食事提供加算無!F62+140600","v":199900},{"$f":"食事提供加算無!G62+140600","v":201300},"障害者入所支援施設"]
[null,"短期入所（単独型）",null,null,null,null,null,"福祉型障害児入所施設"]
[null,null,null,null,null,null,null,"医療型障害児入所施設"]
[null,"自立訓練（機能訓練）",null,null,null,null,null,null,null,218100,219500,199900,201300]
[null,"自立訓練（生活訓練）"]
[null,"自立訓練（宿泊型）"]
[null,"就労移行支援"]
[null,"就労継続支援Ａ型"]
[null,"就労継続支援Ｂ型"]
[]
["key","通所系","高圧・低圧","都市ガス・プロパンガス","金額"]
[{"$f":"B13&C13&D13","v":"生活介護高圧都市ガス"},"生活介護","高圧","都市ガス",218100]
[{"$f":"B14&C14&D14","v":"生活介護高圧プロパンガス"},"生活介護","高圧","プロパンガス",219500]
["生活介護低圧都市ガス","生活介護","低圧","都市ガス",199900]
["生活介護低圧プロパンガス","生活介護","低圧","プロパンガス",201300]
["短期入所（単独型）高圧都市ガス","短期入所（単独型）","高圧","都市ガス",218100]
["短期入所（単独型）高圧プロパンガス","短期入所（単独型）","高圧","プロパンガス",219500]
["短期入所（単独型）低圧都市ガス","短期入所（単独型）","低圧","都市ガス",199900]
["短期入所（単独型）低圧プロパンガス","短期入所（単独型）","低圧","プロパンガス",201300]
["自立訓練（機能訓練）高圧都市ガス","自立訓練（機能訓練）","高圧","都市ガス",218100]
["自立訓練（機能訓練）高圧プロパンガス","自立訓練（機能訓練）","高圧","プロパンガス",219500]
["自立訓練（機能訓練）低圧都市ガス","自立訓練（機能訓練）","低圧","都市ガス",199900]
["自立訓練（機能訓練）低圧プロパンガス","自立訓練（機能訓練）","低圧","プロパンガス",201300]
["自立訓練（生活訓練）高圧都市ガス","自立訓練（生活訓練）","高圧","都市ガス",218100]
["自立訓練（生活訓練）高圧プロパンガス","自立訓練（生活訓練）","高圧","プロパンガス",219500]
["自立訓練（生活訓練）低圧都市ガス","自立訓練（生活訓練）","低圧","都市ガス",199900]
["自立訓練（生活訓練）低圧プロパンガス","自立訓練（生活訓練）","低圧","プロパンガス",201300]
["自立訓練（宿泊型）高圧都市ガス","自立訓練（宿泊型）","高圧","都市ガス",218100]
["自立訓練（宿泊型）高圧プロパンガス","自立訓練（宿泊型）","高圧","プロパンガス",219500]
{"$rows_left_out":46}
{"sheet":"食事提供加算無","index":13,"n_rows":181,"n_cols":12,"rows_kept":181,"cut":false,"hidden":true,"merged":[[159,2,161,2],[159,3,161,3],[159,4,161,4],[61,5,69,5],[61,6,69,6],[111,2,113,2],[111,3,113,3],[111,4,113,4],[111,5,113,5],[111,6,113,6],[133,2,136,2],[133,3,136,3],[133,4,136,4],[133,5,136,5],[133,6,136,6],[1,2,5,2],[1,3,5,3],[1,4,5,4],[61,2,69,2],[61,3,69,3],[61,4,69,4]]}
[null,"訪問系","支給単位","都市ガスを利用している場合","プロパンガスを利用している場合",null,null,null,"サービス種別"]
[null,"居宅介護","１事業所当たり",20800,19800,null,null,null,"生活介護"]
[null,"重度訪問介護",null,null,null,null,null,null,"短期入所（単独型）"]
[null,"同行援護",null,null,null,null,null,null,"療養介護"]
[null,"行動援護",null,null,null,null,null,null,"自立訓練（機能訓練）"]
[null,"重度障害者等包括支援",null,null,null,null,null,null,"自立訓練（生活訓練）"]
[null,null,null,null,null,null,null,null,"自立訓練（宿泊型）"]
["key","訪問系","高圧・低圧","都市ガス・プロパンガス","1人当たりの平均移動距離/日","金額",null,null,"就労移行支援"]
[{"$f":"B9&D9&E9","v":"居宅介護都市ガス同一建物減算有"},"居宅介護","-","都市ガス","同一建物減算有",10500]
["居宅介護プロパンガス同一建物減算有","居宅介護","-","プロパンガス","同一建物減算有",10000]
[{"$f":"B11&D11&E11","v":"居宅介護都市ガス12㌔未満"},"居宅介護","-","都市ガス","12㌔未満",18300,null,null,"就労継続支援Ａ型"]
[{"$f":"B12&D12&E12","v":"居宅介護プロパンガス12㌔未満"},"居宅介護","-","プロパンガス","12㌔未満",17800,null,null,"就労継続支援Ｂ型"]
["居宅介護都市ガス12㌔～22㌔未満","居宅介護","-","都市ガス","12㌔～22㌔未満",25400,null,null,"児童発達支援"]
["居宅介護プロパンガス12㌔～22㌔未満","居宅介護","-","プロパンガス","12㌔～22㌔未満",24900,null,null,"児童発達支援センター"]
["居宅介護都市ガス22㌔以上","居宅介護","-","都市ガス","22㌔以上",28200,null,null,"医療型児童発達支援センター"]
["居宅介護プロパンガス22㌔以上","居宅介護","-","プロパンガス","22㌔以上",27700,null,null,"放課後等デイサービス"]
["重度訪問介護都市ガス12㌔未満","重度訪問介護","-","都市ガス","12㌔未満",18300]
["重度訪問介護プロパンガス12㌔未満","重度訪問介護","-","プロパンガス","12㌔未満",17800]
["重度訪問介護都市ガス12㌔～22㌔未満","重度訪問介護","-","都市ガス","12㌔～22㌔未満",25400,null,null,"同一建物減算有"]
["重度訪問介護プロパンガス12㌔～22㌔未満","重度訪問介護","-","プロパンガス","12㌔～22㌔未満",24900,null,null,"12㌔未満"]
["重度訪問介護都市ガス22㌔以上","重度訪問介護","-","都市ガス","22㌔以上",28200,null,null,"12㌔～22㌔未満"]
["重度訪問介護プロパンガス22㌔以上","重度訪問介護","-","プロパンガス","22㌔以上",27700,null,null,"22㌔以上"]
["同行援護都市ガス12㌔未満","同行援護","-","都市ガス","12㌔未満",18300]
["同行援護プロパンガス12㌔未満","同行援護","-","プロパンガス","12㌔未満",17800]
["同行援護都市ガス12㌔～22㌔未満","同行援護","-","都市ガス","12㌔～22㌔未満",25400]
["同行援護プロパンガス12㌔～22㌔未満","同行援護","-","プロパンガス","12㌔～22㌔未満",24900]
["同行援護都市ガス22㌔以上","同行援護","-","都市ガス","22㌔以上",28200]
["同行援護プロパンガス22㌔以上","同行援護","-","プロパンガス","22㌔以上",27700]
["行動援護都市ガス12㌔未満","行動援護","-","都市ガス","12㌔未満",18300]
["行動援護プロパンガス12㌔未満","行動援護","-","プロパンガス","12㌔未満",17800]
{"$rows_left_out":151}