{"text_format":"1","workbook":"xlsx","n_sheets":7,"sheets":["グラフ","細目グラフ","メニュー","選択表","印刷用集計表","産業分類H25年度改訂版","使用方法"],"not_rendered":{"charts":2,"images":18,"macros":1,"external_links":1,"defined_names":56,"comments":2,"pivot_tables":0},"unopened":[{"sheet":"グラフ","index":0,"reason":"not_a_worksheet"}],"bounds":{"document_bytes":16777216,"sheet_cells":100000,"rows_first":2000,"rows_last":500,"rows_between":2000,"halvings":0,"cell_chars":16384,"cell_head_chars":4096},"cells_cut":0,"cells_raw":0,"read":"whole","date_system":"1900"}

{"sheet":"細目グラフ","index":1,"n_rows":52,"n_cols":114,"rows_kept":52,"cut":false,"hidden":false,"merged":[[0,16,0,56],[3,93,3,94],[3,98,3,99],[3,103,3,104],[1,3,3,4],[1,57,3,58],[3,63,3,64],[3,68,3,69],[3,73,3,74],[3,78,3,79],[3,83,3,84],[3,88,3,89],[3,30,3,31],[3,35,3,36],[3,40,3,41],[3,45,3,46],[3,50,3,51],[0,97,0,109],[1,1,3,1],[1,2,3,2],[3,10,3,11],[3,15,3,16],[3,20,3,21],[3,25,3,26]]}
["◆二酸化炭素削減対策等の取組度評価",null,null,null,null,null,"事　業　所　名",null,null,null,null,null,null,null,null,null,null,null,null,null,null,null,null,null,null,null,null,null,null,null,null,null,null,null,null,null,null,null,null,null,null,null,null,null,null,null,null,null,null,null,null,null,null,null,null,null,null,null,null,null,null,null,null,null,null,null,null,null,null,null,null,null,null,null,null,null,null,null,null,null,null,null,null,null,null,null,null,null,null,null,null,null,null,null,null,"作　成　日"]
[null,"大分類","中分類","基本項目\n自己採点",null,null,"取　組　度　　　　　　",null,null,null,null,null,null,null,null,null,null,null,null,null,null,null,null,null,null,null,null,null,null,null,null,null,null,null,null,null,null,null,null,null,null,null,null,null,null,null,null,null,null,null,null,null,null,null,null,null,null,"標準項目自己採点",null,"取　組　度　　　　　　"]
[null,null,null,null,null,null,0.1,{"$f":"G3+0.1","v":0.2},{"$f":"H3+0.1","v":0.30000000000000004},0.4,0.5,0.6,0.7,0.79999999999999993,0.89999999999999991,0.99999999999999989,1.0999999999999999,1.2,1.3,1.4000000000000001,1.5000000000000002,1.6000000000000003,1.7000000000000004,1.8000000000000005,1.9000000000000006,2.0000000000000004,2.1000000000000005,2.2000000000000006,2.3000000000000007,2.4000000000000008,2.5000000000000009,2.600000000000001,2.7000000000000011,2.8000000000000012,2.9000000000000012,3.0000000000000013,3.1000000000000014,3.2000000000000015,3.3000000000000016,3.4000000000000017,3.5000000000000018,3.6000000000000019,3.700000000000002,3.800000000000002,3.9000000000000021,4.0000000000000018,4.1000000000000014,4.2000000000000011,4.3000000000000007,4.4000000000000004,4.5,4.5999999999999996,4.6999999999999993,4.7999999999999989,4.8999999999999986,4.9999999999999982,null,null,null,0.1,{"$f":"BH3+0.1","v":0.2},{"$f":"BI3+0.1","v":0.30000000000000004},0.4,0.5,0.6,0.7,0.79999999999999993,0.89999999999999991,0.99999999999999989,1.0999999999999999,1.2,1.3,1.4000000000000001,1.5000000000000002,1.6000000000000003,1.7000000000000004,1.8000000000000005,1.9000000000000006,2.0000000000000004,2.1000000000000005,2.2000000000000006,2.3000000000000007,2.4000000000000008,2.5000000000000009,2.600000000000001,2.7000000000000011,2.8000000000000012,2.9000000000000012,3.0000000000000013,3.1000000000000014,3.2000000000000015,3.3000000000000016,3.4000000000000017,3.5000000000000018,3.6000000000000019,3.700000000000002,3.800000000000002,3.9000000000000021,4.0000000000000018,4.1000000000000014,4.2000000000000011,4.3000000000000007,4.4000000000000004,4.5,4.5999999999999996,4.6999999999999993,4.7999999999999989,4.8999999999999986,4.9999999999999982]
[null,null,null,null,null,null,null,null,null,null,"0.5",null,null,null,null,"1.0",null,null,null,null,"1.5",null,null,null,null,"2.0",null,null,null,null,"2.5",null,null,null,null,"3.0",null,null,null,null,"3.5",null,null,null,null,"4.0",null,null,null,null,"4.5",null,null,null,null,"5.0",null,null,null,null,null,null,null,"0.5",null,null,null,null,"1.0",null,null,null,null,"1.5",null,null,null,null,"2.0",null,null,null,null,"2.5",null,null,null,null,"3.0",null,null,null,null,"3.5",null,null,null,null,"4.0",null,null,null,null,"4.5",null,null,null,null,"5.0",null,null,null,null,"対象判定"]
[1,"一般管理事項","省エネ推進体制",{"$f":"印刷用集計表!U6","v":""},{"$f":"印刷用集計表!T6","v":0},null,null,null,null,null,null,null,null,null,null,null,null,null,null,null,null,null,null,null,null,null,null,null,null,null,null,null,null,null,null,null,null,null,null,null,null,null,null,null,null,null,null,null,null,null,null,null,null,null,null,null,null,{"$f":"印刷用集計表!AA6","v":""},{"$f":"印刷用集計表!Z6","v":0},null,null,null,null,null,null,null,null,null,null,null,null,null,null,null,null,null,null,null,null,null,null,null,null,null,null,null,null,null,null,null,null,null,null,null,null,null,null,null,null,null,null,null,null,null,null,null,null,null,null,null,null,null,null,{"$f":"印刷用集計表!AI6","v":0}]
[null,null,"保全・計測・記録",null,{"$f":"印刷用集計表!T13","v":0},null,null,null,null,null,null,null,null,null,null,null,null,null,null,null,null,null,null,null,null,null,null,null,null,null,null,null,null,null,null,null,null,null,null,null,null,null,null,null,null,null,null,null,null,null,null,null,null,null,null,null,null,null,{"$f":"印刷用集計表!Z13","v":0},null,null,null,null,null,null,null,null,null,null,null,null,null,null,null,null,null,null,null,null,null,null,null,null,null,null,null,null,null,null,null,null,null,null,null,null,null,null,null,null,null,null,null,null,null,null,null,null,null,null,null,null,null,null,{"$f":"印刷用集計表!AI13","v":0}]
{"$rows_left_out":47}
{"sheet":"メニュー","index":2,"n_rows":0,"n_cols":0,"rows_kept":0,"cut":false,"hidden":false,"merged":[]}

{"sheet":"選択表","index":3,"n_rows":288,"n_cols":51,"rows_kept":288,"cut":false,"hidden":true,"merged":[[238,13,238,14],[239,13,239,14],[27,1,77,1],[81,1,107,1],[111,1,146,1],[150,1,161,1],[184,1,198,1],[165,1,180,1],[202,1,214,1],[218,1,231,1],[236,13,236,14],[232,2,234,2],[212,13,212,14],[184,2,198,2],[111,2,120,2],[121,2,125,2],[108,13,108,14],[81,2,88,2],[27,13,27,14],[78,2,80,2],[108,2,110,2],[50,2,59,2],[68,2,77,2],[60,2,67,2],[249,1,270,1],[240,13,240,14],[160,2,161,2],[162,25,164,25],[162,31,164,31],[163,13,163,14],[164,13,164,14],[204,13,204,14],[205,13,205,14],[206,13,206,14],[175,13,175,14],[176,13,176,14],[213,13,213,14],[214,13,214,14],[198,13,198,14],[169,13,169,14],[207,13,207,14],[208,13,208,14],[223,13,223,14],[224,13,224,14],[225,13,225,14],[221,13,221,14],[222,13,222,14],[218,26,231,26],[202,2,214,2],[219,13,219,14],[226,13,226,14],[201,13,201,14],[215,2,217,2],[215,13,215,14],[162,2,164,2],[162,13,162,14],[181,13,181,14],[218,13,218,14],[209,13,209,14],[210,13,210,14],[211,13,211,14],[202,13,202,14],[203,13,203,14],[172,2,180,2],[181,2,183,2],[165,2,171,2],[172,13,172,14],[195,13,195,14],[181,25,183,25],[182,13,182,14],[183,13,183,14],[165,13,165,14],[165,31,171,31],[166,13,166,14],[167,13,167,14],[168,13,168,14],[181,31,183,31],[172,31,180,31],[173,13,173,14],[174,13,174,14],[177,13,177,14],[235,2,237,2],[235,13,235,14],[235,31,237,31],[237,13,237,14],[215,25,217,25],[215,31,217,31],[216,13,216,14],[217,13,217,14],[227,2,231,2],[227,31,231,31],[228,13,228,14],[229,13,229,14],[230,13,230,14],[231,13,231,14],[218,31,226,31],[227,13,227,14],[249,32,270,32],[250,13,250,14],[251,13,251,14],[252,13,252,14],[253,13,253,14],[255,13,255,14],[254,13,254,14],[256,13,256,14],[257,13,257,14],[258,13,258,14],[249,13,249,14],[249,31,262,31],[259,13,259,14],[260,13,260,14],[261,13,261,14],[262,13,262,14],[263,13,263,14],[264,13,264,14],[266,13,266,14],[267,13,267,14],[268,13,268,14],[269,13,269,14],[270,13,270,14],[150,32,159,32],[151,13,151,14],[152,13,152,14],[153,13,153,14],[154,13,154,14],[155,13,155,14],[232,13,232,14],[232,25,234,25],[232,31,234,31],[233,13,233,14],[234,13,234,14],[156,13,156,14],[157,13,157,14],[158,13,158,14],[159,13,159,14],[218,32,226,32],[150,13,150,14],[220,13,220,14],[184,31,198,31],[199,13,199,14],[199,25,201,25],[199,31,201,31],[200,13,200,14],[150,31,159,31],[276,31,278,31],[277,13,277,14],[278,13,278,14],[265,13,265,14],[276,2,278,2],[276,13,276,14],[276,25,278,25],[263,2,268,2],[199,2,201,2],[269,2,270,2],[244,13,244,14],[245,13,245,14],[246,2,248,2],[246,13,246,14],[246,25,248,25],[246,31,248,31],[202,31,214,31],[271,13,271,14],[272,13,272,14],[273,13,273,14],[274,13,274,14],[275,13,275,14],[271,2,275,2],[242,13,242,14],[184,32,198,32],[185,13,185,14],[186,13,186,14],[187,13,187,14],[188,13,188,14],[189,13,189,14],[190,13,190,14],[191,13,191,14],[184,13,184,14],[192,13,192,14],[193,13,193,14],[194,13,194,14],[196,13,196,14],[197,13,197,14],[165,32,180,32],[178,13,178,14],[179,13,179,14],[180,13,180,14],[170,13,170,14],[171,13,171,14],[160,31,161,31],[161,13,161,14],[131,31,138,31],[132,13,132,14],[133,13,133,14],[135,13,135,14],[136,13,136,14],[137,13,137,14],[138,13,138,14],[131,13,131,14],[147,31,149,31],[148,13,148,14],[149,13,149,14],[139,31,144,31],[140,13,140,14],[144,13,144,14],[145,31,146,31],[160,13,160,14],[121,31,125,31],[122,13,122,14],[123,13,123,14],[124,13,124,14],[125,13,125,14],[126,13,126,14],[126,31,130,31],[127,13,127,14],[129,13,129,14],[130,13,130,14],[121,13,121,14],[128,13,128,14],[111,31,120,31],[111,32,120,32],[112,13,112,14],[113,13,113,14],[114,13,114,14],[115,13,115,14],[116,13,116,14],[117,13,117,14],[120,13,120,14],[118,13,118,14],[119,13,119,14],[111,13,111,14],[139,2,144,2],[139,13,139,14],[131,2,138,2],[126,2,130,2],[147,2,149,2],[147,13,147,14],[147,25,149,25],[145,2,146,2],[145,13,145,14],[142,13,142,14],[143,13,143,14],[146,13,146,14],[141,13,141,14],[108,25,110,25],[108,31,110,31],[109,13,109,14],[110,13,110,14],[102,13,102,14],[103,13,103,14],[104,13,104,14],[105,13,105,14],[106,13,106,14],[107,13,107,14],[67,13,67,14],[81,32,88,32],[82,13,82,14],[83,13,83,14],[84,13,84,14],[85,13,85,14],[86,13,86,14],[87,13,87,14],[88,13,88,14],[81,13,81,14],[81,31,88,31],[77,13,77,14],[78,31,80,31],[79,13,79,14],[80,13,80,14],[68,31,77,31],[69,13,69,14],[70,13,70,14],[71,13,71,14],[72,13,72,14],[73,13,73,14],[78,13,78,14],[78,25,80,25],[76,13,76,14],[68,13,68,14],[74,13,74,14],[75,13,75,14],[98,13,98,14],[99,13,99,14],[100,13,100,14],[101,13,101,14],[89,13,89,14],[91,13,91,14],[92,13,92,14],[93,13,93,14],[94,13,94,14],[95,13,95,14],[96,13,96,14],[97,13,97,14],[27,32,35,32],[28,13,28,14],[29,13,29,14],[30,13,30,14],[36,13,36,14],[37,13,37,14],[38,13,38,14],[39,13,39,14],[33,13,33,14],[31,13,31,14],[32,13,32,14],[34,13,34,14],[35,13,35,14],[12,13,12,14],[24,31,26,31],[8,31,13,31],[26,13,26,14],[25,13,25,14],[48,13,48,14],[65,13,65,14],[57,13,57,14],[51,13,51,14],[55,13,55,14],[58,13,58,14],[42,13,42,14],[44,13,44,14],[40,13,40,14],[41,13,41,14],[56,13,56,14],[62,13,62,14],[63,13,63,14],[64,13,64,14],[46,13,46,14],[47,13,47,14],[60,31,67,31],[61,13,61,14],[66,13,66,14],[253,2,262,2],[1,32,7,32],[2,13,2,14],[3,13,3,14],[4,13,4,14],[5,13,5,14],[6,13,6,14],[7,13,7,14],[20,2,22,2],[20,13,20,14],[20,31,22,31],[22,13,22,14],[14,2,19,2],[14,13,14,14],[14,31,19,31],[15,13,15,14],[24,2,26,2],[60,13,60,14],[45,13,45,14],[24,13,24,14],[1,31,7,31],[241,13,241,14],[1,2,7,2],[1,13,1,14],[89,2,96,2],[97,2,107,2],[243,13,243,14],[247,13,247,14],[248,13,248,14],[0,18,0,20],[90,13,90,14],[134,13,134,14],[249,2,252,2],[0,1,0,2],[23,13,23,14],[0,11,0,12],[16,13,16,14],[17,13,17,14],[18,13,18,14],[8,2,13,2],[8,13,8,14],[9,13,9,14],[10,13,10,14],[11,13,11,14],[13,13,13,14],[1,1,23,1],[19,13,19,14],[0,13,0,14]]}
["番号","分 類",null,"分類","事務所ビル","店舗・商業施設","工場 現場","病院 学校","倉庫 置場","自動車","対象","基本対策は●",null,"チェック項目",null,"自己\n採点","県評価","対象","基本項目",null,null,"対象","事業所採点","合計点","項目数","細目点","評価点","対象数","県採点","合計点","項目数","細目点","大分類","説明",null,null,null,null,null,false,false,false,false,false,false,null,"非対称事象","評価点計","対象個数"]
[1,"一般管理事項","省エネ推進体制",1,1,1,1,1,1,1,{"$f":"IF(E2*AN$2+F2*AO2+G2*AP$2+H2*AQ$2+I2*AR$2+J2*AS$2>0,1,0)","v":0},"●",1,"エネルギー管理(省エネ活動)を継続的に行う組織があるか　",null,null,null,{"$f":"IF(P2=\"\",0,COUNTA(P2)*COUNTIF(L2,\"●\"))","v":0},{"$f":"IF(R2=0,0,IF(P2=\"○\",5,IF(P2=\"△\",3,IF(P2=\"×\",1,0))))*IF(L2=\"●\",1,0)","v":0},{"$f":"IFERROR(SUM(S2:S8)/SUM(R2:R8),0)","v":0},{"$f":"IFERROR(SUM(S2:S24)/SUM(R2:R24),0)","v":0},{"$f":"IF(P2=\"\",0,1)","v":0},{"$f":"IF(V2=0,0,IF(P2=\"○\",5,IF(P2=\"△\",3,IF(P2=\"×\",1,0))))","v":0},{"$f":"SUM(W2:W8)","v":0},{"$f":"COUNTIF(V2:V8,1)","v":0},{"$f":"IFERROR(X2/Y2,0)","v":0},{"$f":"IFERROR((X2+X9+X15+X21+X24)/(Y2+Y9+Y15+X21+Y24),0)","v":0},{"$f":"K2*IF(Q2=\"－\",0,1)","v":0},{"$f":"IF(K2=0,\"\",IF(Q2=\"○\",5,IF(Q2=\"△\",3,IF(Q2=\"×\",1,0))))","v":""},{"$f":"SUM(AC2:AC8)","v":0},{"$f":"COUNTIF(AB2:AB8,1)","v":0},{"$f":"AD2/AE2","v":{"$error":"#DIV/0!"}},{"$f":"(AD2+AD9+AD15+AD21+AD24)/(AE2+AE9+AE15+AD21+AE24)","v":{"$error":"#DIV/0!"}},null,null,null,null,null,null,{"$f":"IF(AN1=TRUE,1,0)","v":0},0,0,0,0,0,null,null,null,null,"○","○"]
[1,null,null,1,1,1,1,1,1,1,{"$f":"IF(E3*AN$2+F3*AO3+G3*AP$2+H3*AQ$2+I3*AR$2+J3*AS$2>0,1,0)","v":0},"●",2,"省エネ目標を設定し、省エネのPDCAを回す活動をしているか",null,null,null,{"$f":"IF(P3=\"\",0,COUNTA(P3)*COUNTIF(L3,\"●\"))","v":0},{"$f":"IF(R3=0,0,IF(P3=\"○\",5,IF(P3=\"△\",3,IF(P3=\"×\",1,0))))*IF(L3=\"●\",1,0)","v":0},null,null,{"$f":"IF(P3=\"\",0,1)","v":0},{"$f":"IF(V3=0,0,IF(P3=\"○\",5,IF(P3=\"△\",3,IF(P3=\"×\",1,0))))","v":0},null,null,null,null,{"$f":"K3*IF(Q3=\"－\",0,1)","v":0},{"$f":"IF(K3=0,\"\",IF(Q3=\"○\",5,IF(Q3=\"△\",3,IF(Q3=\"×\",1,0))))","v":""},null,null,null,null,null,null,null,null,null,null,null,null,null,null,null,null,null,null,null,null,"△","△"]
[1,null,null,1,1,1,1,1,1,1,0,null,3,"省エネの目標に対して、投資予算を確保しているか",null,null,null,0,0,null,null,0,0,null,null,null,null,0,"",null,null,null,null,"省エネ予算の確保",null,null,null,null,null,null,null,null,null,null,null,null,null,null,null,"×","×"]
[1,null,null,1,1,1,1,1,1,1,0,null,4,"省エネ対策の年度計画や中長期計画を設定、予算を確保しているか",null,null,null,0,0,null,null,0,0,null,null,null,null,0,"",null,null,null,null,null,null,null,null,null,null,null,null,null,null,null,null,null,null,null,null,null,"－"]
[1,null,null,1,1,1,1,1,1,1,0,"●",5,"省エネ実施状況の掲示(年間・月毎の目標と実績等）をしているか",null,null,null,0,0,null,null,0,0,null,null,null,null,0,"",null,null,null,null,"掲示板やポータルでの公表、目標や実績情報の共有化"]
{"$rows_left_out":283}
{"sheet":"印刷用集計表","index":4,"n_rows":303,"n_cols":52,"rows_kept":303,"cut":false,"hidden":true,"merged":[[243,13,243,14],[93,2,100,2],[0,0,0,13],[85,2,92,2],[112,2,114,2],[88,13,88,14],[89,13,89,14],[90,13,90,14],[28,2,30,2],[28,13,28,14],[24,2,26,2],[24,13,24,14],[91,13,91,14],[92,13,92,14],[114,13,114,14],[105,13,105,14],[31,13,31,14],[42,13,42,14],[43,13,43,14],[79,13,79,14],[101,2,111,2],[49,2,53,2],[40,2,48,2],[31,2,39,2],[246,13,246,14],[249,13,249,14],[1,18,1,20],[267,2,272,2],[157,13,157,14],[158,13,158,14],[159,13,159,14],[160,13,160,14],[161,13,161,14],[162,13,162,14],[163,13,163,14],[155,13,155,14],[165,13,165,14],[164,2,165,2],[166,2,168,2],[191,13,191,14],[192,13,192,14],[193,13,193,14],[194,13,194,14],[195,13,195,14],[142,13,142,14],[151,2,153,2],[151,13,151,14],[242,13,242,14],[231,2,235,2],[37,13,37,14],[232,13,232,14],[233,13,233,14],[234,13,234,14],[235,13,235,14],[236,2,238,2],[236,13,236,14],[115,2,124,2],[125,2,129,2],[169,2,175,2],[144,13,144,14],[196,13,196,14],[197,13,197,14],[166,13,166,14],[84,13,84,14],[72,2,81,2],[223,13,223,14],[224,13,224,14],[230,13,230,14],[222,13,222,14],[170,13,170,14],[171,13,171,14],[122,13,122,14],[203,31,205,31],[204,13,204,14],[205,13,205,14],[211,13,211,14],[212,13,212,14],[217,13,217,14],[218,13,218,14],[219,13,219,14],[213,13,213,14],[216,13,216,14],[214,13,214,14],[215,13,215,14],[206,13,206,14],[207,13,207,14],[208,13,208,14],[219,25,221,25],[219,31,221,31],[220,13,220,14],[221,13,221,14],[280,31,282,31],[259,13,259,14],[239,13,239,14],[282,13,282,14],[273,13,273,14],[274,13,274,14],[280,13,280,14],[280,25,282,25],[264,13,264,14],[265,13,265,14],[266,13,266,14],[267,13,267,14],[270,13,270,14],[271,13,271,14],[272,13,272,14],[269,13,269,14],[240,13,240,14],[250,31,252,31],[250,25,252,25],[245,13,245,14],[247,13,247,14],[248,13,248,14],[241,13,241,14],[244,13,244,14],[280,2,282,2],[250,2,252,2],[250,13,250,14],[268,13,268,14],[281,13,281,14],[251,13,251,14],[275,13,275,14],[276,13,276,14],[277,13,277,14],[278,13,278,14],[273,2,274,2],[254,13,254,14],[255,13,255,14],[256,13,256,14],[257,13,257,14],[258,13,258,14],[252,13,252,14],[253,13,253,14],[260,13,260,14],[261,13,261,14],[262,13,262,14],[263,13,263,14],[279,13,279,14],[275,2,279,2],[236,31,238,31],[238,13,238,14],[231,13,231,14],[231,25,235,25],[236,25,238,25],[237,13,237,14],[225,13,225,14],[226,13,226,14],[227,13,227,14],[228,13,228,14],[229,13,229,14],[185,31,187,31],[186,13,186,14],[209,13,209,14],[210,13,210,14],[185,25,187,25],[169,13,169,14],[166,25,168,25],[168,13,168,14],[185,13,185,14],[172,13,172,14],[173,13,173,14],[174,13,174,14],[175,13,175,14],[183,13,183,14],[187,13,187,14],[176,13,176,14],[177,13,177,14],[178,13,178,14],[202,13,202,14],[198,13,198,14],[200,13,200,14],[201,13,201,14],[203,13,203,14],[203,25,205,25],[199,13,199,14],[123,13,123,14],[167,13,167,14],[176,2,184,2],[151,25,153,25],[150,13,150,14],[143,13,143,14],[94,13,94,14],[179,13,179,14],[180,13,180,14],[181,13,181,14],[182,13,182,14],[156,13,156,14],[135,2,142,2],[135,13,135,14],[154,13,154,14],[184,13,184,14],[153,13,153,14],[115,13,115,14],[164,13,164,14],[125,13,125,14],[188,13,188,14],[126,13,126,14],[127,13,127,14],[128,13,128,14],[129,13,129,14],[130,13,130,14],[145,13,145,14],[146,13,146,14],[147,13,147,14],[139,13,139,14],[140,13,140,14],[148,13,148,14],[149,13,149,14],[131,13,131,14],[132,13,132,14],[133,13,133,14],[134,13,134,14],[71,13,71,14],[65,13,65,14],[112,25,114,25],[86,13,86,14],[87,13,87,14],[96,13,96,14],[97,13,97,14],[98,13,98,14],[99,13,99,14],[100,13,100,14],[104,13,104,14],[111,13,111,14],[112,13,112,14],[103,13,103,14],[101,13,101,14],[102,13,102,14],[74,13,74,14],[95,13,95,14],[85,13,85,14],[66,13,66,14],[67,13,67,14],[68,13,68,14],[69,13,69,14],[70,13,70,14],[54,2,63,2],[55,13,55,14],[59,13,59,14],[62,13,62,14],[81,13,81,14],[82,2,84,2],[3,37,4,37],[5,2,11,2],[5,13,5,14],[3,28,3,32],[3,33,4,33],[3,34,4,34],[3,35,4,35],[3,10,4,10],[3,11,4,12],[11,13,11,14],[12,2,17,2],[12,13,12,14],[13,13,13,14],[14,13,14,14],[72,13,72,14],[64,13,64,14],[80,13,80,14],[73,13,73,14],[60,13,60,14],[52,13,52,14],[41,13,41,14],[44,13,44,14],[45,13,45,14],[46,13,46,14],[3,36,4,36],[26,13,26,14],[3,21,3,26],[3,17,3,20],[16,13,16,14],[4,18,4,20],[8,13,8,14],[9,13,9,14],[10,13,10,14],[15,13,15,14],[17,13,17,14],[283,11,283,12],[154,2,163,2],[244,2,249,2],[106,13,106,14],[107,13,107,14],[108,13,108,14],[109,13,109,14],[110,13,110,14],[116,13,116,14],[253,2,256,2],[257,2,266,2],[130,2,134,2],[149,2,150,2],[143,2,148,2],[189,13,189,14],[190,13,190,14],[141,13,141,14],[138,13,138,14],[113,13,113,14],[124,13,124,14],[227,2,230,2],[225,2,226,2],[222,2,224,2],[206,2,218,2],[0,15,0,33],[3,13,4,14],[3,15,4,15],[3,16,4,16],[6,13,6,14],[7,13,7,14],[82,31,84,31],[33,13,33,14],[34,13,34,14],[36,13,36,14],[38,13,38,14],[83,13,83,14],[48,13,48,14],[49,13,49,14],[50,13,50,14],[51,13,51,14],[75,13,75,14],[76,13,76,14],[77,13,77,14],[78,13,78,14],[32,13,32,14],[28,25,30,25],[28,31,30,31],[1,21,1,26],[2,0,2,1],[2,2,2,12],[2,17,2,20],[2,14,2,15],[1,14,1,17],[39,13,39,14],[40,13,40,14],[35,13,35,14],[27,13,27,14],[18,2,23,2],[18,13,18,14],[20,13,20,14],[21,13,21,14],[22,13,22,14],[23,13,23,14],[19,13,19,14],[5,0,27,0],[5,1,27,1],[31,0,81,0],[1,0,1,1],[1,2,1,12],[3,0,4,2],[3,3,4,3],[31,1,81,1],[2,21,2,33],[3,4,4,4],[3,6,4,6],[3,7,4,7],[3,8,4,8],[3,9,4,9],[152,13,152,14],[117,13,117,14],[118,13,118,14],[119,13,119,14],[120,13,120,14],[121,13,121,14],[93,13,93,14],[136,13,136,14],[137,13,137,14],[112,31,114,31],[151,31,153,31],[30,13,30,14],[29,13,29,14],[82,13,82,14],[61,13,61,14],[57,13,57,14],[47,13,47,14],[3,5,4,5],[219,2,221,2],[203,2,205,2],[64,2,71,2],[85,1,111,1],[85,0,111,0],[112,0,114,0],[115,0,150,0],[115,1,150,1],[253,1,279,1],[239,1,249,1],[239,0,249,0],[222,0,235,0],[222,1,235,1],[206,0,218,0],[206,1,218,1],[253,0,279,0],[154,0,165,0],[154,1,165,1],[188,0,202,0],[188,1,202,1],[169,0,184,0],[169,1,184,1],[188,2,202,2],[185,2,187,2]]}
["二酸化炭素削減対策自己診断結果",null,null,null,null,null,null,null,null,null,null,null,null,null,"対象施設",{"$f":"AN2&\"　\"&AO2&\"  \"&AP2&\"　\"&AQ2&\"　\"&AR2&\"　\"&AS2","v":"　  　　　"}]
["事業者名",null,null,null,null,null,null,null,null,null,null,null,null,"事業所名",null,null,null,null,"記入日",null,null,null,null,null,null,null,null,null,null,null,null,null,null,null,null,null,"基本実施率","標準－基本回答数",null,{"$f":"IF(AN4=TRUE,\"ビル･事務所\",\"\")","v":""},{"$f":"IF(AO4=TRUE,\"店舗･商業施設\",\"\")","v":""},{"$f":"IF(AP4=TRUE,\"工場･ﾌﾟﾗﾝﾄ･現場\",\"\")","v":""},{"$f":"IF(AQ4=TRUE,\"医療施設･学校等\",\"\")","v":""},{"$f":"IF(AR4=TRUE,\"倉庫・資材置場\",\"\")","v":""},{"$f":"IF(AS4=TRUE,\"自動車\",\"\")","v":""}]
["大分類",null,"建設業",null,null,null,null,null,null,null,null,null,null,"中分類",null,null,null,"小分類",null,null,null,null,null,null,null,null,null,null,null,null,null,null,null,null,null,null,null,null,null,null,null,null,null,null,null,null,null,null,null,null,null,{"$f":"VLOOKUP(C3,産業分類H25年度改訂版!O2:R21,4,FALSE)","v":"DD"}]
["分類",null,null,"分類","事務所ビル","店舗･商業施設","工場 現場","病院 学校","倉庫 置場","自動車","対象","基本対策は●",null,"チェック項目",null,"自己採点","県評価","基本項目採点",null,null,null,"標準項目自己採点",null,null,null,null,null,null,"県採点",null,null,null,null,"記事・所見欄",null,null,null,null,null,{"$f":"選択表!AN1","v":false},{"$f":"選択表!AO1","v":false},{"$f":"選択表!AP1","v":false},{"$f":"選択表!AQ1","v":false},{"$f":"選択表!AR1","v":false},{"$f":"選択表!AS1","v":false}]
[null,null,null,null,null,null,null,null,null,null,null,null,null,null,null,null,null,"対象","基本項目",null,null,"対象","採点","合計","項目数","小分類","大分類","対象数","県採点","合計","項目数","小分類","大分類",null,null,null,null,null,null,{"$f":"IF(AN4=TRUE,1,0)","v":0},0,0,0,0,0,"非対称事象","評価点計","対象個数"]
[1,"一般管理事項","省エネ推進体制",1,{"$f":"IF(選択表!E2=1,1,0)","v":1},{"$f":"IF(選択表!F2=1,1,0)","v":1},{"$f":"IF(選択表!G2=1,1,0)","v":1},{"$f":"IF(選択表!H2=1,1,0)","v":1},{"$f":"IF(選択表!I2=1,1,0)","v":1},{"$f":"IF(選択表!J2=1,1,0)","v":1},{"$f":"IF(選択表!K2=1,1,0)","v":0},{"$f":"IF(選択表!L2=\"●\",選択表!L2,\"\")","v":"●"},1,{"$f":"選択表!$N2","v":"エネルギー管理(省エネ活動)を継続的に行う組織があるか　"},null,{"$f":"IF(選択表!$P2=\"\",\"\",選択表!$P2)","v":""},{"$f":"IF(選択表!$Q2=\"\",\"\",選択表!$Q2)","v":""},{"$f":"IF(P6=\"\",0,COUNTA(P6)*COUNTIF(L6,\"●\"))","v":0},{"$f":"IF(R6=0,0,IF(P6=\"○\",5,IF(P6=\"△\",3,IF(P6=\"×\",1,0))))*IF(L6=\"●\",1,0)","v":0},{"$f":"IFERROR(SUM(S6:S12)/SUM(R6:R12),0)","v":0},{"$f":"IF(AM6=1,IFERROR(SUM(S6:S28)/SUM(R6:R28),0),\"\")","v":""},{"$f":"IF(P6=\"\",0,1)","v":0},{"$f":"IF(V6=0,0,IF(P6=\"○\",5,IF(P6=\"△\",3,IF(P6=\"×\",1,0))))","v":0},{"$f":"SUM(W6:W12)","v":0},{"$f":"COUNTIF(V6:V12,1)","v":0},{"$f":"IFERROR(X6/Y6,0)","v":0},{"$f":"IF(AM6=1,IFERROR((X6+X13+X19+X25+X28)/(Y6+Y13+Y19+Y25+Y28),0),\"\")","v":""},{"$f":"IF(Q6=\"対象外\",0,IF(OR(P6=\"○\",P6=\"△\",P6=\"×\",Q6=\"○\",Q6=\"△\",Q6=\"×\"),1,0))","v":0},{"$f":"IF(K6=0,\"\",IF(Q6=P6,W6,IF(Q6=\"○\",5,IF(Q6=\"△\",3,IF(Q6=\"×\",1,0)))))","v":""},{"$f":"SUM(AC6:AC12)","v":0},{"$f":"COUNTIF(AB6:AB12,1)","v":0},{"$f":"AD6/AE6","v":{"$error":"#DIV/0!"}},{"$f":"(AD6+AD13+AD19+AD25+AD28)/(AE6+AE13+AE19+AD25+AE28)","v":{"$error":"#DIV/0!"}},null,{"$f":"IF(SUM(K6:K12)>0,1,0)","v":0},null,{"$f":"SUM(R6:R28)/COUNTIF(L6:L28,\"●\")","v":0},{"$f":"SUM(V6:V28)-SUM(R6:R28)","v":0},{"$f":"IF(SUM(V6:V28)>=1,1,0)","v":0},null,null,null,null,null,null,null,null,null,"○","○"]
{"$rows_left_out":298}
{"sheet":"産業分類H25年度改訂版","index":5,"n_rows":1456,"n_cols":23,"rows_kept":1456,"cut":false,"hidden":true,"merged":[]}
["L1分類コード","L1分類名称","L2分類コード","L2分類名称","L3分類コード","L3分類名称","L4分類コード","L4分類名称",null,null,null,null,null,"L1分類コード","L1分類名称",null,null,null,"L2分類名称",null,null,"L3分類コード","L3分類名称"]
["A","農業，林業",1,"農業",10,"管理，補助的経済活動を行う事業所（01農業）",100,"主として管理事務を行う本社等",null,null,null,null,null,"A","農業・林業",null,null,"AA","1農業",null,{"$f":"V2&W2","v":"10管理，補助的経済活動を行う事業所（01農業）"},10,"管理，補助的経済活動を行う事業所（01農業）"]
["A","農業，林業",1,"農業",10,"管理，補助的経済活動を行う事業所（01農業）",109,"その他の管理，補助的経済活動を行う事業所",null,null,null,null,null,"B","漁業",null,null,"BB","2林業",null,{"$f":"V3&W3","v":"11耕種農業"},11,"耕種農業"]
["A","農業，林業",1,"農業",11,"耕種農業",111,"米作農業",null,null,null,null,null,"C","鉱業・採石業・砂利採取業",null,null,"CC","3漁業（水産養殖業を除く）",null,"12畜産農業",12,"畜産農業"]
["A","農業，林業",1,"農業",11,"耕種農業",112,"米作以外の穀作農業",null,null,null,null,null,"D","建設業",null,null,"DD","4水産養殖業",null,"13農業サービス業（園芸サービス業を除く）",13,"農業サービス業（園芸サービス業を除く）"]
["A","農業，林業",1,"農業",11,"耕種農業",113,"野菜作農業（きのこ類の栽培を含む）",null,null,null,null,null,"E","製造業",null,null,"EE","5鉱業，採石業，砂利採取業",null,"14園芸サービス業",14,"園芸サービス業"]
{"$rows_left_out":1451}
{"sheet":"使用方法","index":6,"n_rows":85,"n_cols":10,"rows_kept":85,"cut":false,"hidden":true,"merged":[[5,1,5,4],[4,1,4,4],[3,1,3,4],[0,0,0,9]]}
["本ファイルの使用方法"]
[null,null,null,null,null,null,null,null,null,"ver.2.11"]
["目次"]
[null,"１．使用上の留意事項"]
[null,"２．記入方法について"]
[null,"３．結果の表示とシートの印刷方法"]
{"$rows_left_out":79}