{"text_format":"1","workbook":"xlsx","n_sheets":37,"sheets":["スタート画面","スタート画面_初利用","保護者の皆様へ","子供たちへ","初期設定","日付選択","スタート","カレンダー","睡眠","起床","寝起き","朝食","学校遊び朝","学校勉強","学校遊び昼","給食","お家遊び","お家勉強","夜ごはん","はみがき","テレビゲーム","お風呂シャワー","はいべん","入力確認","日報","誕生日","週計","集計(週)","集計(年)","月別スコア","基本項目","参考(質問回答)","画像置場","回答一覧","年齢計算用","開発用","メダルの判定"],"not_rendered":{"charts":0,"images":58,"macros":1,"external_links":1,"defined_names":9,"comments":1,"pivot_tables":0},"unopened":[],"bounds":{"document_bytes":16777216,"sheet_cells":100000,"rows_first":2000,"rows_last":500,"rows_between":2000,"halvings":0,"cell_chars":16384,"cell_head_chars":4096},"cells_cut":0,"cells_raw":0,"read":"whole","date_system":"1900"}

{"sheet":"スタート画面","index":0,"n_rows":2,"n_cols":2,"rows_kept":2,"cut":false,"hidden":false,"merged":[[12,2,15,8],[16,2,19,8],[20,2,23,8],[24,2,27,8],[1,1,4,9]]}
[]
[null,"「せいかつしゅうかんしんだんシート」"]

{"sheet":"スタート画面_初利用","index":1,"n_rows":0,"n_cols":0,"rows_kept":0,"cut":false,"hidden":false,"merged":[[0,0,8,9],[12,1,15,7],[16,1,19,7],[20,1,23,7],[24,1,27,7]]}

{"sheet":"保護者の皆様へ","index":2,"n_rows":54,"n_cols":4,"rows_kept":54,"cut":false,"hidden":false,"merged":[]}
[]
[]
[]
[]
[]
[]
{"$rows_left_out":49}
{"sheet":"子供たちへ","index":3,"n_rows":0,"n_cols":0,"rows_kept":0,"cut":false,"hidden":false,"merged":[]}

{"sheet":"初期設定","index":4,"n_rows":9,"n_cols":16,"rows_kept":9,"cut":false,"hidden":false,"merged":[[6,4,6,5],[7,4,7,13],[1,4,1,13],[2,4,2,13],[5,4,5,13],[4,4,4,5],[3,12,3,13],[3,4,3,7]]}
[]
[null,null,null,"おなまえ","さいたま　けんたろう"]
[null,null,null,"がっこうめい","さいたま第二小学校"]
[null,null,null,"がくねん",{"$f":"IF(ISERROR(VLOOKUP(DATEDIF(O5,$P$4,\"Y\"),LIST,2,TRUE)),\"\",VLOOKUP(DATEDIF(O5,$P$4,\"Y\"),LIST,2,TRUE))","v":"1ねん"},null,null,null,6,"くみ",null,15,"ばん",null,{"$f":"G5","v":2010},{"$f":"DATE(YEAR(TODAY())-(MONTH(TODAY())<=3)*1,4,1)","v":"2017-04-01"}]
[null,null,null,"せいねんがっぴ","平成",null,2010,"年",10,"月",2,7,"日",null,{"$f":"O4&\"/\" & IF(I5=\"\",1,I5) & \"/\" & IF(AND(K5=\"\",L5=\"\"),1,K5&L5)","v":"2010/10/27"},{"$f":"IF(ISERROR(O5+0),\"err\",O5+0)","v":"2010-10-27"}]
[null,null,null,"せいべつ","おとこ",null,null,null,null,null,null,null,null,null,{"$f":"G7","v":2017}]
{"$rows_left_out":4}
{"sheet":"日付選択","index":5,"n_rows":0,"n_cols":0,"rows_kept":0,"cut":false,"hidden":false,"merged":[]}

{"sheet":"スタート","index":6,"n_rows":6,"n_cols":2,"rows_kept":6,"cut":false,"hidden":false,"merged":[[7,6,7,12]]}
[null,{"$f":"IF(ISERROR(VLOOKUP(A1,'集計(年)'!A4:V368,22,FALSE)),\"0\",VLOOKUP(A1,'集計(年)'!A4:V368,22,FALSE))","v":"0"}]
[]
[]
[]
["2017-11-01"]
["2018-10-31"]
{"$rows_left_out":1}
{"sheet":"カレンダー","index":7,"n_rows":17,"n_cols":20,"rows_kept":17,"cut":false,"hidden":false,"merged":[[11,20,12,20],[11,5,12,7],[11,8,12,8],[11,17,12,18],[11,19,12,19]]}
["2013-02-01"]
[null,"2017/11/01からきょうのあいだからえらんでね"]
[]
[]
[]
[]
{"$rows_left_out":12}
{"sheet":"睡眠","index":8,"n_rows":27,"n_cols":8,"rows_kept":27,"cut":false,"hidden":false,"merged":[[22,4,25,4],[22,7,25,7],[22,2,25,3],[22,5,25,6]]}
[]
[]
[]
[]
[]
[]
{"$rows_left_out":22}
{"sheet":"起床","index":9,"n_rows":27,"n_cols":8,"rows_kept":27,"cut":false,"hidden":false,"merged":[[22,4,25,4],[22,7,25,7],[22,2,25,3],[22,5,25,6]]}
[]
[]
[]
[]
[]
[]
{"$rows_left_out":22}
{"sheet":"寝起き","index":10,"n_rows":1,"n_cols":4,"rows_kept":1,"cut":false,"hidden":false,"merged":[]}
[null,null,"00:00:00","00:00:00"]

{"sheet":"朝食","index":11,"n_rows":0,"n_cols":0,"rows_kept":0,"cut":false,"hidden":false,"merged":[]}

{"sheet":"学校遊び朝","index":12,"n_rows":0,"n_cols":0,"rows_kept":0,"cut":false,"hidden":false,"merged":[]}

{"sheet":"学校勉強","index":13,"n_rows":0,"n_cols":0,"rows_kept":0,"cut":false,"hidden":false,"merged":[]}

{"sheet":"学校遊び昼","index":14,"n_rows":0,"n_cols":0,"rows_kept":0,"cut":false,"hidden":false,"merged":[]}

{"sheet":"給食","index":15,"n_rows":0,"n_cols":0,"rows_kept":0,"cut":false,"hidden":false,"merged":[]}

{"sheet":"お家遊び","index":16,"n_rows":0,"n_cols":0,"rows_kept":0,"cut":false,"hidden":false,"merged":[]}

{"sheet":"お家勉強","index":17,"n_rows":0,"n_cols":0,"rows_kept":0,"cut":false,"hidden":false,"merged":[]}

{"sheet":"夜ごはん","index":18,"n_rows":0,"n_cols":0,"rows_kept":0,"cut":false,"hidden":false,"merged":[]}

{"sheet":"はみがき","index":19,"n_rows":0,"n_cols":0,"rows_kept":0,"cut":false,"hidden":false,"merged":[]}

{"sheet":"テレビゲーム","index":20,"n_rows":0,"n_cols":0,"rows_kept":0,"cut":false,"hidden":false,"merged":[]}

{"sheet":"お風呂シャワー","index":21,"n_rows":0,"n_cols":0,"rows_kept":0,"cut":false,"hidden":false,"merged":[]}

{"sheet":"はいべん","index":22,"n_rows":0,"n_cols":0,"rows_kept":0,"cut":false,"hidden":false,"merged":[]}

{"sheet":"入力確認","index":23,"n_rows":18,"n_cols":6,"rows_kept":18,"cut":false,"hidden":false,"merged":[[2,1,5,1],[6,1,8,1],[9,1,11,1],[12,1,13,1],[14,1,17,1]]}
[null,null,"きょう の こたえ の みなおし"]
[null,null,"しつもん","こたえ","やりなおす？"]
[null,"すいみん","ねたじかん","09:00:00",null,1]
[null,null,"おきたじかん","07:00:00",null,2]
[null,null,"すいみんじかん","10:00:00"]
[null,null,"じぶんでおきた","①じぶんでおきた",null,3]
{"$rows_left_out":13}
{"sheet":"日報","index":24,"n_rows":19,"n_cols":4,"rows_kept":19,"cut":false,"hidden":false,"merged":[[18,2,19,10],[3,1,4,11],[1,1,2,11],[7,3,8,9],[5,3,6,9]]}
[1]
[null,"2017-10-31"]
[]
[null,"今日の“せいかつ”メダル"]
[]
[null,null,null,{"$f":"初期設定!E3&\" \"&初期設定!E4","v":"さいたま第二小学校 1ねん"}]
{"$rows_left_out":14}
{"sheet":"誕生日","index":25,"n_rows":19,"n_cols":3,"rows_kept":19,"cut":false,"hidden":false,"merged":[[2,2,3,10],[6,2,7,10],[18,2,20,10],[4,2,5,10]]}
[]
[]
[null,null,{"$f":"TODAY()","v":"2017-10-31"}]
[]
[null,null,"おたんじょうびおめでとう"]
[]
{"$rows_left_out":14}
{"sheet":"週計","index":26,"n_rows":37,"n_cols":20,"rows_kept":37,"cut":false,"hidden":false,"merged":[[35,5,35,9],[36,5,36,9],[37,5,37,9],[35,1,35,3],[36,1,36,3],[37,1,37,3],[15,1,16,1],[17,1,20,1],[21,1,21,2],[4,10,5,10],[6,1,8,1],[6,2,7,2],[6,10,7,10],[9,1,11,1],[12,1,14,1]]}
["2017-10-31",{"$f":"IF(ISERROR(VLOOKUP(A1,'集計(年)'!A4:V368,22,FALSE)),\"0\",VLOOKUP(A1,'集計(年)'!A4:V368,22,FALSE))","v":"0"},{"$f":"INDIRECT(\"'集計(年)'!AB\"&B1)","v":{"$error":"#REF!"}}]
[null,"2017/09/30からきょうのあいだからえらんでね"]
[]
[]
[null,null,"　　　　　　　　　　　　　　　　　　ひにち ","6日前","5日前","4日前","3日前","おととい","きのう","きょう","いっしゅうかん\nメダルのいろ"]
[null,null,"　　こうもく",{"$f":"E6-1","v":"2017-10-25"},"2017-10-26","2017-10-27","2017-10-28","2017-10-29","2017-10-30","2017-10-31",null,null,"取得する列","1の合計","2の合計","3の合計","4の合計","0の合計","白の判定","排便（銀)の判定"]
{"$rows_left_out":32}
{"sheet":"集計(週)","index":27,"n_rows":22,"n_cols":11,"rows_kept":22,"cut":false,"hidden":true,"merged":[[15,1,16,1],[17,1,20,1],[21,1,21,2],[4,10,5,10],[6,1,8,1],[6,2,7,2],[6,10,7,10],[9,1,11,1],[12,1,14,1]]}
[]
[]
[]
[]
[null,null,"　　　　　　　　　　　　　　　　　　ひにち ","１日目","２日目","３日目","４日目","５日目","６日目","７日目","いっしゅかん\nメダルのいろ"]
[null,null,"　　こうもく","/","/","/","/","/","/","/"]
{"$rows_left_out":17}
{"sheet":"集計(年)","index":28,"n_rows":384,"n_cols":28,"rows_kept":384,"cut":false,"hidden":false,"merged":[[0,1,0,4],[0,19,1,19],[0,8,0,10],[0,11,0,12],[0,5,0,7],[0,13,0,16]]}
[{"$f":"COUNTA(B4:B368)","v":0},"すいみん",null,null,null,"しょくじ",null,null,"うんどう",null,null,"べん\nき\nょ\nう",null,"そのほか",null,null,null,null,null,"きょうのメダルのいろ","※選択３が一個でもあれば銅(3),項目１が13個（全て選択１）なら金（１）、選択１が6個以下でも銅（３）"]
[2013,"じぶんで\nおきた","睡眠時間","就寝","起床","あさ","　ひる","よる","あさ","ぎょうかん","おうちに\nかえって","がっこう","おうちで","テレビ・ゲーム","おふろ","はみがき","はいべん","本人の一言","保護者のひとこと",null,null,"09:00:00","10:00:00","11:00:00"]
["平均",{"$f":"IF($A$1<>0,AVERAGE(B4:B368),\"-\")","v":"-"},{"$f":"IF($A$1<>0,AVERAGE(C4:C368),\"-\")","v":"-"},"-","-","-","-","-","-","-","-","-","-","-","-","-","-",null,null,{"$f":"IF($A$1<>0,AVERAGE(T4:T368),\"-\")","v":"-"},"睡眠時間の評価","行番号","１の合計","２の合計","３の合計","4の合計","合計","学校の有無"]
["2017-11-01",null,null,null,null,null,null,null,null,null,null,null,null,null,null,null,null,null,null,{"$f":"IF(AA4=13,IF(OR(Y4>=1,Z4>=1),4,IF(W4=13,1,IF(W4>=7,2,3))),0)","v":0},{"$f":"IF(D4=\"\",0,IF(D4<=$V$2,1,IF(D4<=$W$2,2,IF(D4<=$X$2,3,4))))","v":0},{"$f":"ROW($A4)","v":4},{"$f":"COUNTIF($B4,1) + COUNTIF($F4:$P4,1) + COUNTIF($U4,1)","v":0},{"$f":"COUNTIF($B4,2) + COUNTIF($F4:$P4,2) + COUNTIF($U4,2)","v":0},{"$f":"COUNTIF($B4,3) + COUNTIF($F4:$P4,3) + COUNTIF($U4,3)","v":0},{"$f":"COUNTIF($B4,4) + COUNTIF($F4:$P4,4) + COUNTIF($U4,4)","v":0},{"$f":"SUM(W4:Z4)","v":0}]
[{"$f":"A4+1","v":"2017-11-02"},null,null,null,null,null,null,null,null,null,null,null,null,null,null,null,null,null,null,0,{"$f":"IF(D5=\"\",0,IF(D5<=$V$2,1,IF(D5<=$W$2,2,IF(D5<=$X$2,3,4))))","v":0},{"$f":"ROW($A5)","v":5},0,0,0,{"$f":"COUNTIF($B5,4) + COUNTIF($F5:$P5,4) + COUNTIF($U5,4)","v":0},{"$f":"SUM(W5:Z5)","v":0}]
[{"$f":"A5+1","v":"2017-11-03"},null,null,null,null,null,null,null,null,null,null,null,null,null,null,null,null,null,null,0,0,6,0,0,0,0,0]
{"$rows_left_out":379}
{"sheet":"月別スコア","index":29,"n_rows":21,"n_cols":45,"rows_kept":21,"cut":false,"hidden":false,"merged":[[1,42,1,44],[18,42,18,44],[19,3,19,5],[19,6,19,8],[19,9,19,11],[19,12,19,14],[19,15,19,17],[19,18,19,20],[19,21,19,23],[19,24,19,26],[19,27,19,29],[19,30,19,32],[19,33,19,35],[19,36,19,38],[19,39,19,41],[18,15,18,17],[1,15,1,17],[17,1,18,2],[18,3,18,5],[18,6,18,8],[18,9,18,11],[3,1,4,1],[5,1,7,1],[8,1,10,1],[11,1,12,1],[13,1,16,1],[18,12,18,14],[1,3,1,5],[1,6,1,8],[1,9,1,11],[1,12,1,14],[18,36,18,38],[18,39,18,41],[18,18,18,20],[18,21,18,23],[1,39,1,41],[1,21,1,23],[1,24,1,26],[1,27,1,29],[1,30,1,32],[1,33,1,35],[1,36,1,38],[18,24,18,26],[18,27,18,29],[18,30,18,32],[18,33,18,35],[1,18,1,20]]}
["2017-10-31",null,"せいかつしゅうかん ねんかん かくにんひょう"]
[null,null,"　　　　　　　　　　　　　　　　　つき",{"$f":"D19","v":"2017年11月"},null,null,{"$f":"G19","v":"2017年12月"},null,null,{"$f":"J19","v":"2018年1月"},null,null,{"$f":"M19","v":"2018年2月"},null,null,{"$f":"P19","v":"2018年3月"},null,null,{"$f":"S19","v":"2018年4月"},null,null,{"$f":"V19","v":"2018年5月"},null,null,{"$f":"Y19","v":"2018年6月"},null,null,{"$f":"AB19","v":"2018年7月"},null,null,{"$f":"AE19","v":"2018年8月"},null,null,{"$f":"AH19","v":"2018年9月"},null,null,{"$f":"AK19","v":"2018年10月"},null,null,{"$f":"AN19","v":"2018年11月"},null,null,"ねんかんごうけい"]
[null,null,"　　こうもく"]
[null,"すいみん","すいみんじかん",{"$f":"COUNTIF(INDIRECT(\"'集計(年)'!U\"&D$21):INDIRECT(\"'集計(年)'!U\"&E$21),1)","v":0},{"$f":"COUNTIF(INDIRECT(\"'集計(年)'!U\"&D$21):INDIRECT(\"'集計(年)'!U\"&E$21),2)","v":0},{"$f":"COUNTIF(INDIRECT(\"'集計(年)'!U\"&D$21):INDIRECT(\"'集計(年)'!U\"&E$21),3)","v":0},{"$f":"COUNTIF(INDIRECT(\"'集計(年)'!U\"&G$21):INDIRECT(\"'集計(年)'!U\"&H$21),1)","v":0},{"$f":"COUNTIF(INDIRECT(\"'集計(年)'!U\"&G$21):INDIRECT(\"'集計(年)'!U\"&H$21),2)","v":0},{"$f":"COUNTIF(INDIRECT(\"'集計(年)'!U\"&G$21):INDIRECT(\"'集計(年)'!U\"&H$21),3)","v":0},{"$f":"COUNTIF(INDIRECT(\"'集計(年)'!U\"&J$21):INDIRECT(\"'集計(年)'!U\"&K$21),1)","v":0},{"$f":"COUNTIF(INDIRECT(\"'集計(年)'!U\"&J$21):INDIRECT(\"'集計(年)'!U\"&K$21),2)","v":0},{"$f":"COUNTIF(INDIRECT(\"'集計(年)'!U\"&J$21):INDIRECT(\"'集計(年)'!U\"&K$21),3)","v":0},{"$f":"COUNTIF(INDIRECT(\"'集計(年)'!U\"&M$21):INDIRECT(\"'集計(年)'!U\"&N$21),1)","v":0},{"$f":"COUNTIF(INDIRECT(\"'集計(年)'!U\"&M$21):INDIRECT(\"'集計(年)'!U\"&N$21),2)","v":0},{"$f":"COUNTIF(INDIRECT(\"'集計(年)'!U\"&M$21):INDIRECT(\"'集計(年)'!U\"&N$21),3)","v":0},{"$f":"COUNTIF(INDIRECT(\"'集計(年)'!U\"&P$21):INDIRECT(\"'集計(年)'!U\"&Q$21),1)","v":0},{"$f":"COUNTIF(INDIRECT(\"'集計(年)'!U\"&P$21):INDIRECT(\"'集計(年)'!U\"&Q$21),2)","v":0},{"$f":"COUNTIF(INDIRECT(\"'集計(年)'!U\"&P$21):INDIRECT(\"'集計(年)'!U\"&Q$21),3)","v":0},{"$f":"COUNTIF(INDIRECT(\"'集計(年)'!U\"&S$21):INDIRECT(\"'集計(年)'!U\"&T$21),1)","v":0},{"$f":"COUNTIF(INDIRECT(\"'集計(年)'!U\"&S$21):INDIRECT(\"'集計(年)'!U\"&T$21),2)","v":0},{"$f":"COUNTIF(INDIRECT(\"'集計(年)'!U\"&S$21):INDIRECT(\"'集計(年)'!U\"&T$21),3)","v":0},{"$f":"COUNTIF(INDIRECT(\"'集計(年)'!U\"&V$21):INDIRECT(\"'集計(年)'!U\"&W$21),1)","v":0},{"$f":"COUNTIF(INDIRECT(\"'集計(年)'!U\"&V$21):INDIRECT(\"'集計(年)'!U\"&W$21),2)","v":0},{"$f":"COUNTIF(INDIRECT(\"'集計(年)'!U\"&V$21):INDIRECT(\"'集計(年)'!U\"&W$21),3)","v":0},{"$f":"COUNTIF(INDIRECT(\"'集計(年)'!U\"&Y$21):INDIRECT(\"'集計(年)'!U\"&Z$21),1)","v":0},{"$f":"COUNTIF(INDIRECT(\"'集計(年)'!U\"&Y$21):INDIRECT(\"'集計(年)'!U\"&Z$21),2)","v":0},{"$f":"COUNTIF(INDIRECT(\"'集計(年)'!U\"&Y$21):INDIRECT(\"'集計(年)'!U\"&Z$21),3)","v":0},{"$f":"COUNTIF(INDIRECT(\"'集計(年)'!U\"&AB$21):INDIRECT(\"'集計(年)'!U\"&AC$21),1)","v":0},{"$f":"COUNTIF(INDIRECT(\"'集計(年)'!U\"&AB$21):INDIRECT(\"'集計(年)'!U\"&AC$21),2)","v":0},{"$f":"COUNTIF(INDIRECT(\"'集計(年)'!U\"&AB$21):INDIRECT(\"'集計(年)'!U\"&AC$21),3)","v":0},{"$f":"COUNTIF(INDIRECT(\"'集計(年)'!U\"&AE$21):INDIRECT(\"'集計(年)'!U\"&AF$21),1)","v":0},{"$f":"COUNTIF(INDIRECT(\"'集計(年)'!U\"&AE$21):INDIRECT(\"'集計(年)'!U\"&AF$21),2)","v":0},{"$f":"COUNTIF(INDIRECT(\"'集計(年)'!U\"&AE$21):INDIRECT(\"'集計(年)'!U\"&AF$21),3)","v":0},{"$f":"COUNTIF(INDIRECT(\"'集計(年)'!U\"&AH$21):INDIRECT(\"'集計(年)'!U\"&AI$21),1)","v":0},{"$f":"COUNTIF(INDIRECT(\"'集計(年)'!U\"&AH$21):INDIRECT(\"'集計(年)'!U\"&AI$21),2)","v":0},{"$f":"COUNTIF(INDIRECT(\"'集計(年)'!U\"&AH$21):INDIRECT(\"'集計(年)'!U\"&AI$21),3)","v":0},{"$f":"COUNTIF(INDIRECT(\"'集計(年)'!U\"&AK$21):INDIRECT(\"'集計(年)'!U\"&AL$21),1)","v":0},{"$f":"COUNTIF(INDIRECT(\"'集計(年)'!U\"&AK$21):INDIRECT(\"'集計(年)'!U\"&AL$21),2)","v":0},{"$f":"COUNTIF(INDIRECT(\"'集計(年)'!U\"&AK$21):INDIRECT(\"'集計(年)'!U\"&AL$21),3)","v":0},{"$f":"COUNTIF(INDIRECT(\"'集計(年)'!U\"&AN$21):INDIRECT(\"'集計(年)'!U\"&AO$21),1)","v":0},{"$f":"COUNTIF(INDIRECT(\"'集計(年)'!U\"&AN$21):INDIRECT(\"'集計(年)'!U\"&AO$21),2)","v":0},{"$f":"COUNTIF(INDIRECT(\"'集計(年)'!U\"&AN$21):INDIRECT(\"'集計(年)'!U\"&AO$21),3)","v":0},{"$f":"SUM(D4,G4,J4,M4,P4,S4,V4,Y4,AB4,AE4,AH4,AK4,AN4)","v":0},{"$f":"SUM(E4,H4,K4,N4,Q4,T4,W4,Z4,AC4,AF4,AI4,AL4,AO4)","v":0},{"$f":"SUM(F4,I4,L4,O4,R4,U4,X4,AA4,AD4,AG4,AJ4,AM4,AP4)","v":0}]
[null,null,"じぶんでおきた",{"$f":"COUNTIF(INDIRECT(\"'集計(年)'!B\"&D$21):INDIRECT(\"'集計(年)'!B\"&E$21),1)","v":0},{"$f":"COUNTIF(INDIRECT(\"'集計(年)'!B\"&D$21):INDIRECT(\"'集計(年)'!B\"&E$21),2)","v":0},{"$f":"COUNTIF(INDIRECT(\"'集計(年)'!B\"&D$21):INDIRECT(\"'集計(年)'!B\"&E$21),3)","v":0},{"$f":"COUNTIF(INDIRECT(\"'集計(年)'!B\"&G$21):INDIRECT(\"'集計(年)'!B\"&H$21),1)","v":0},{"$f":"COUNTIF(INDIRECT(\"'集計(年)'!B\"&G$21):INDIRECT(\"'集計(年)'!B\"&H$21),2)","v":0},{"$f":"COUNTIF(INDIRECT(\"'集計(年)'!B\"&G$21):INDIRECT(\"'集計(年)'!B\"&H$21),3)","v":0},{"$f":"COUNTIF(INDIRECT(\"'集計(年)'!B\"&J$21):INDIRECT(\"'集計(年)'!B\"&K$21),1)","v":0},{"$f":"COUNTIF(INDIRECT(\"'集計(年)'!B\"&J$21):INDIRECT(\"'集計(年)'!B\"&K$21),2)","v":0},{"$f":"COUNTIF(INDIRECT(\"'集計(年)'!B\"&J$21):INDIRECT(\"'集計(年)'!B\"&K$21),3)","v":0},{"$f":"COUNTIF(INDIRECT(\"'集計(年)'!B\"&M$21):INDIRECT(\"'集計(年)'!B\"&N$21),1)","v":0},{"$f":"COUNTIF(INDIRECT(\"'集計(年)'!B\"&M$21):INDIRECT(\"'集計(年)'!B\"&N$21),2)","v":0},{"$f":"COUNTIF(INDIRECT(\"'集計(年)'!B\"&M$21):INDIRECT(\"'集計(年)'!B\"&N$21),3)","v":0},{"$f":"COUNTIF(INDIRECT(\"'集計(年)'!B\"&P$21):INDIRECT(\"'集計(年)'!B\"&Q$21),1)","v":0},{"$f":"COUNTIF(INDIRECT(\"'集計(年)'!B\"&P$21):INDIRECT(\"'集計(年)'!B\"&Q$21),2)","v":0},{"$f":"COUNTIF(INDIRECT(\"'集計(年)'!B\"&P$21):INDIRECT(\"'集計(年)'!B\"&Q$21),3)","v":0},{"$f":"COUNTIF(INDIRECT(\"'集計(年)'!B\"&S$21):INDIRECT(\"'集計(年)'!B\"&T$21),1)","v":0},{"$f":"COUNTIF(INDIRECT(\"'集計(年)'!B\"&S$21):INDIRECT(\"'集計(年)'!B\"&T$21),2)","v":0},{"$f":"COUNTIF(INDIRECT(\"'集計(年)'!B\"&S$21):INDIRECT(\"'集計(年)'!B\"&T$21),3)","v":0},{"$f":"COUNTIF(INDIRECT(\"'集計(年)'!B\"&V$21):INDIRECT(\"'集計(年)'!B\"&W$21),1)","v":0},{"$f":"COUNTIF(INDIRECT(\"'集計(年)'!B\"&V$21):INDIRECT(\"'集計(年)'!B\"&W$21),2)","v":0},{"$f":"COUNTIF(INDIRECT(\"'集計(年)'!B\"&V$21):INDIRECT(\"'集計(年)'!B\"&W$21),3)","v":0},{"$f":"COUNTIF(INDIRECT(\"'集計(年)'!B\"&Y$21):INDIRECT(\"'集計(年)'!B\"&Z$21),1)","v":0},{"$f":"COUNTIF(INDIRECT(\"'集計(年)'!B\"&Y$21):INDIRECT(\"'集計(年)'!B\"&Z$21),2)","v":0},{"$f":"COUNTIF(INDIRECT(\"'集計(年)'!B\"&Y$21):INDIRECT(\"'集計(年)'!B\"&Z$21),3)","v":0},{"$f":"COUNTIF(INDIRECT(\"'集計(年)'!B\"&AB$21):INDIRECT(\"'集計(年)'!B\"&AC$21),1)","v":0},{"$f":"COUNTIF(INDIRECT(\"'集計(年)'!B\"&AB$21):INDIRECT(\"'集計(年)'!B\"&AC$21),2)","v":0},{"$f":"COUNTIF(INDIRECT(\"'集計(年)'!B\"&AB$21):INDIRECT(\"'集計(年)'!B\"&AC$21),3)","v":0},{"$f":"COUNTIF(INDIRECT(\"'集計(年)'!B\"&AE$21):INDIRECT(\"'集計(年)'!B\"&AF$21),1)","v":0},{"$f":"COUNTIF(INDIRECT(\"'集計(年)'!B\"&AE$21):INDIRECT(\"'集計(年)'!B\"&AF$21),2)","v":0},{"$f":"COUNTIF(INDIRECT(\"'集計(年)'!B\"&AE$21):INDIRECT(\"'集計(年)'!B\"&AF$21),3)","v":0},{"$f":"COUNTIF(INDIRECT(\"'集計(年)'!B\"&AH$21):INDIRECT(\"'集計(年)'!B\"&AI$21),1)","v":0},{"$f":"COUNTIF(INDIRECT(\"'集計(年)'!B\"&AH$21):INDIRECT(\"'集計(年)'!B\"&AI$21),2)","v":0},{"$f":"COUNTIF(INDIRECT(\"'集計(年)'!B\"&AH$21):INDIRECT(\"'集計(年)'!B\"&AI$21),3)","v":0},{"$f":"COUNTIF(INDIRECT(\"'集計(年)'!B\"&AK$21):INDIRECT(\"'集計(年)'!B\"&AL$21),1)","v":0},{"$f":"COUNTIF(INDIRECT(\"'集計(年)'!B\"&AK$21):INDIRECT(\"'集計(年)'!B\"&AL$21),2)","v":0},{"$f":"COUNTIF(INDIRECT(\"'集計(年)'!B\"&AK$21):INDIRECT(\"'集計(年)'!B\"&AL$21),3)","v":0},{"$f":"COUNTIF(INDIRECT(\"'集計(年)'!B\"&AN$21):INDIRECT(\"'集計(年)'!B\"&AO$21),1)","v":0},{"$f":"COUNTIF(INDIRECT(\"'集計(年)'!B\"&AN$21):INDIRECT(\"'集計(年)'!B\"&AO$21),2)","v":0},{"$f":"COUNTIF(INDIRECT(\"'集計(年)'!B\"&AN$21):INDIRECT(\"'集計(年)'!B\"&AO$21),3)","v":0},{"$f":"SUM(D5,G5,J5,M5,P5,S5,V5,Y5,AB5,AE5,AH5,AK5,AN5)","v":0},{"$f":"SUM(E5,H5,K5,N5,Q5,T5,W5,Z5,AC5,AF5,AI5,AL5,AO5)","v":0},{"$f":"SUM(F5,I5,L5,O5,R5,U5,X5,AA5,AD5,AG5,AJ5,AM5,AP5)","v":0}]
[null,"しょくじ","あさ　\nおいしくぜんぶたべた",{"$f":"COUNTIF(INDIRECT(\"'集計(年)'!F\"&D$21):INDIRECT(\"'集計(年)'!F\"&E$21),1)","v":0},{"$f":"COUNTIF(INDIRECT(\"'集計(年)'!F\"&D$21):INDIRECT(\"'集計(年)'!F\"&E$21),2)","v":0},{"$f":"COUNTIF(INDIRECT(\"'集計(年)'!F\"&D$21):INDIRECT(\"'集計(年)'!F\"&E$21),3)","v":0},{"$f":"COUNTIF(INDIRECT(\"'集計(年)'!F\"&G$21):INDIRECT(\"'集計(年)'!F\"&H$21),1)","v":0},{"$f":"COUNTIF(INDIRECT(\"'集計(年)'!F\"&G$21):INDIRECT(\"'集計(年)'!F\"&H$21),2)","v":0},{"$f":"COUNTIF(INDIRECT(\"'集計(年)'!F\"&G$21):INDIRECT(\"'集計(年)'!F\"&H$21),3)","v":0},{"$f":"COUNTIF(INDIRECT(\"'集計(年)'!F\"&J$21):INDIRECT(\"'集計(年)'!F\"&K$21),1)","v":0},{"$f":"COUNTIF(INDIRECT(\"'集計(年)'!F\"&J$21):INDIRECT(\"'集計(年)'!F\"&K$21),2)","v":0},{"$f":"COUNTIF(INDIRECT(\"'集計(年)'!F\"&J$21):INDIRECT(\"'集計(年)'!F\"&K$21),3)","v":0},{"$f":"COUNTIF(INDIRECT(\"'集計(年)'!F\"&M$21):INDIRECT(\"'集計(年)'!F\"&N$21),1)","v":0},{"$f":"COUNTIF(INDIRECT(\"'集計(年)'!F\"&M$21):INDIRECT(\"'集計(年)'!F\"&N$21),2)","v":0},{"$f":"COUNTIF(INDIRECT(\"'集計(年)'!F\"&M$21):INDIRECT(\"'集計(年)'!F\"&N$21),3)","v":0},{"$f":"COUNTIF(INDIRECT(\"'集計(年)'!F\"&P$21):INDIRECT(\"'集計(年)'!F\"&Q$21),1)","v":0},{"$f":"COUNTIF(INDIRECT(\"'集計(年)'!F\"&P$21):INDIRECT(\"'集計(年)'!F\"&Q$21),2)","v":0},{"$f":"COUNTIF(INDIRECT(\"'集計(年)'!F\"&P$21):INDIRECT(\"'集計(年)'!F\"&Q$21),3)","v":0},{"$f":"COUNTIF(INDIRECT(\"'集計(年)'!F\"&S$21):INDIRECT(\"'集計(年)'!F\"&T$21),1)","v":0},{"$f":"COUNTIF(INDIRECT(\"'集計(年)'!F\"&S$21):INDIRECT(\"'集計(年)'!F\"&T$21),2)","v":0},{"$f":"COUNTIF(INDIRECT(\"'集計(年)'!F\"&S$21):INDIRECT(\"'集計(年)'!F\"&T$21),3)","v":0},{"$f":"COUNTIF(INDIRECT(\"'集計(年)'!F\"&V$21):INDIRECT(\"'集計(年)'!F\"&W$21),1)","v":0},{"$f":"COUNTIF(INDIRECT(\"'集計(年)'!F\"&V$21):INDIRECT(\"'集計(年)'!F\"&W$21),2)","v":0},{"$f":"COUNTIF(INDIRECT(\"'集計(年)'!F\"&V$21):INDIRECT(\"'集計(年)'!F\"&W$21),3)","v":0},{"$f":"COUNTIF(INDIRECT(\"'集計(年)'!F\"&Y$21):INDIRECT(\"'集計(年)'!F\"&Z$21),1)","v":0},{"$f":"COUNTIF(INDIRECT(\"'集計(年)'!F\"&Y$21):INDIRECT(\"'集計(年)'!F\"&Z$21),2)","v":0},{"$f":"COUNTIF(INDIRECT(\"'集計(年)'!F\"&Y$21):INDIRECT(\"'集計(年)'!F\"&Z$21),3)","v":0},{"$f":"COUNTIF(INDIRECT(\"'集計(年)'!F\"&AB$21):INDIRECT(\"'集計(年)'!F\"&AC$21),1)","v":0},{"$f":"COUNTIF(INDIRECT(\"'集計(年)'!F\"&AB$21):INDIRECT(\"'集計(年)'!F\"&AC$21),2)","v":0},{"$f":"COUNTIF(INDIRECT(\"'集計(年)'!F\"&AB$21):INDIRECT(\"'集計(年)'!F\"&AC$21),3)","v":0},{"$f":"COUNTIF(INDIRECT(\"'集計(年)'!F\"&AE$21):INDIRECT(\"'集計(年)'!F\"&AF$21),1)","v":0},{"$f":"COUNTIF(INDIRECT(\"'集計(年)'!F\"&AE$21):INDIRECT(\"'集計(年)'!F\"&AF$21),2)","v":0},{"$f":"COUNTIF(INDIRECT(\"'集計(年)'!F\"&AE$21):INDIRECT(\"'集計(年)'!F\"&AF$21),3)","v":0},{"$f":"COUNTIF(INDIRECT(\"'集計(年)'!F\"&AH$21):INDIRECT(\"'集計(年)'!F\"&AI$21),1)","v":0},{"$f":"COUNTIF(INDIRECT(\"'集計(年)'!F\"&AH$21):INDIRECT(\"'集計(年)'!F\"&AI$21),2)","v":0},{"$f":"COUNTIF(INDIRECT(\"'集計(年)'!F\"&AH$21):INDIRECT(\"'集計(年)'!F\"&AI$21),3)","v":0},{"$f":"COUNTIF(INDIRECT(\"'集計(年)'!F\"&AK$21):INDIRECT(\"'集計(年)'!F\"&AL$21),1)","v":0},{"$f":"COUNTIF(INDIRECT(\"'集計(年)'!F\"&AK$21):INDIRECT(\"'集計(年)'!F\"&AL$21),2)","v":0},{"$f":"COUNTIF(INDIRECT(\"'集計(年)'!F\"&AK$21):INDIRECT(\"'集計(年)'!F\"&AL$21),3)","v":0},{"$f":"COUNTIF(INDIRECT(\"'集計(年)'!F\"&AN$21):INDIRECT(\"'集計(年)'!F\"&AO$21),1)","v":0},{"$f":"COUNTIF(INDIRECT(\"'集計(年)'!F\"&AN$21):INDIRECT(\"'集計(年)'!F\"&AO$21),2)","v":0},{"$f":"COUNTIF(INDIRECT(\"'集計(年)'!F\"&AN$21):INDIRECT(\"'集計(年)'!F\"&AO$21),3)","v":0},0,0,0]
{"$rows_left_out":16}
{"sheet":"基本項目","index":30,"n_rows":23,"n_cols":3,"rows_kept":23,"cut":false,"hidden":false,"merged":[]}
["・基本項目"]
["１・","答えは1～3の数値"]
["２・","データは年で持ち、最大出力範囲は週単位"]
["３・","“次へ”“戻る”でシートの移動を行う"]
["４・","画面の基本設計：文字＝白、背景＝グリーン、選択時処理＝非選択をトーンダウン"]
["５・","兄弟がいるときの処理は可能？"]
{"$rows_left_out":18}
{"sheet":"参考(質問回答)","index":31,"n_rows":27,"n_cols":2,"rows_kept":27,"cut":false,"hidden":false,"merged":[]}
["【質問事項についての回答】"]
[]
["Ｑ１：イラストの書き込みなどは想定をしないでよいか。"]
[null,"回答：各質問の部分以外で、実際の画面上に空いている部分等、イラストの書き込みが必要になる場合もあります。"]
[null,"　　　"]
[]
{"$rows_left_out":22}
{"sheet":"画像置場","index":32,"n_rows":0,"n_cols":0,"rows_kept":0,"cut":false,"hidden":false,"merged":[]}

{"sheet":"回答一覧","index":33,"n_rows":8,"n_cols":13,"rows_kept":8,"cut":false,"hidden":false,"merged":[]}
["寝起き","朝食","給食","夜ごはん","学校遊び朝","学校遊び昼","お家遊び","学校勉強","お家勉強","テレビゲーム","お風呂シャワー","はみがき","はいべん"]
["①じぶんでおきた","①おいしくぜんぶたべた","①おいしくぜんぶたべた","①おいしくぜんぶたべた","①そとであそんだ","①そとであそんだ","①そとであそんだ","①すすんでべんきょうができた","①30ぷんよりおおくべんきょうをした","①１じかんよりすくなかった","①おふろにはいった","①3かいはみがきをした","①あさにでてすっきりした"]
["②おこしてもらっておきた","②きらいなものをのこした","②きらいなものをのこした","②きらいなものをのこした","②そとですこしあそんだ","②そとですこしあそんだ","②そとですこしあそんだ","②べんきょうができた","②30ぷんよりすくなかったがべんきょうをした","②1じかんよりおおかった","②あらっただけ（シャワー）","②2かいはみがきをした","②ひるかよるにでた"]
["③おこしてもらったけどすぐにおきなかった","③すこししかたべなかった","③すこししかたべなかった","③すこししかたべなかった","③そとであそばなかった","③そとであそばなかった","③そとであそばなかった","③べんきょうができなかった","③べんきょうをしなかった","③２じかんよりおおかった","③はいらなかった","③1かいはみがきをした・1かいもしなかった","③でなかった"]
[1,2,6,9,3,5,"①3じかんよりおおかった",4,8,11,12,10,13]
[null,null,null,null,null,null,"②1じかんよりおおかった"]
{"$rows_left_out":3}
{"sheet":"年齢計算用","index":34,"n_rows":17,"n_cols":2,"rows_kept":17,"cut":false,"hidden":false,"merged":[]}
[0,"未就学児"]
[6,"1ねん"]
[7,"2ねん"]
[8,"3ねん"]
[9,"4年"]
[10,"5年"]
{"$rows_left_out":12}
{"sheet":"開発用","index":35,"n_rows":495,"n_cols":3,"rows_kept":495,"cut":false,"hidden":true,"merged":[]}
["スタート画面","グループ化 3"]
["スタート画面","スタート","【開発中】入力シート(作業中).xlsm'!スタート画面_Click"]
["スタート画面","はじめて","【開発中】入力シート(作業中).xlsm'!スタート画面_Click"]
["スタート画面","一週間の確認","【開発中】入力シート(作業中).xlsm'!一週間の確認_click"]
["スタート画面","月刊スコア","【開発中】入力シート(作業中).xlsm'!スタート画面_Click"]
["スタート画面_初利用","保護者の皆様へ","【開発中】入力シート(作業中).xlsm'!スタート画面_Click"]
{"$rows_left_out":490}
{"sheet":"メダルの判定","index":36,"n_rows":44,"n_cols":8,"rows_kept":44,"cut":false,"hidden":false,"merged":[[26,2,27,5],[26,7,27,8],[5,2,6,5],[5,7,6,8],[8,2,9,5],[8,7,9,8],[11,2,12,5],[11,7,12,8],[14,3,15,4],[20,2,21,5],[20,7,21,8],[23,2,24,5],[23,7,24,8],[43,3,44,4],[29,3,30,4],[34,2,35,5],[34,7,35,8],[37,2,38,5],[37,7,38,8],[40,2,41,5],[40,7,41,8]]}
["メダル判定の考え方"]
[null,"※○＝選択肢１、三角＝選択肢２、×＝選択肢３"]
[null,"※一日単位では未入力はないはず"]
[null,"<<一週間のメダル>>"]
[]
[null,null,"○7個",null,null,null,"y","金"]
{"$rows_left_out":38}